program: Gaussian 16
title: Title Card Required
version: ES64L-G16RevC.01
method: UB3LYP
basis: GenECP
operation: Freq
keyword: #N
keyword: Geom=AllCheck
keyword: Guess=TCheck
keyword: SCRF=Check
keyword: GenChk
keyword: UB3LYP/GenECP
keyword: Freq
converged: YES YES YES YES
elementType: C
elementType: O
elementType: H
elementType: Br
1716.lowfreq: -558.0268 -2.4830 -0.0076 -0.0070 0.0068 4.1513 4.5998 18.5508 21.9822
frequency: -558.0268 18.4449 21.9744 24.5643 29.6007 34.9413 40.3951 45.3606 46.5279 51.8547 58.1297 60.4866 62.0744 67.5502 70.9392 75.8491 78.7799 86.2548 92.4863 106.9851 124.1547 129.6705 130.2344 135.0196 149.2611 156.4166 158.6909 182.7474 188.8766 197.7750 210.8321 217.9630 237.4448 238.7652 241.5584 242.6268 246.2227 252.1789 272.7922 279.8555 285.9204 289.8252 290.7340 304.3314 311.5342 315.3181 325.7307 339.4076 346.4907 362.9414 369.3371 377.3625 403.1880 413.0753 459.4821 493.9008 498.4180 529.8997 551.4495 572.9968 575.4677 586.2347 592.8687 607.2046 610.7150 615.6615 620.9392 622.6880 623.6861 628.3246 637.9884 681.4041 696.0895 698.1767 699.7205 715.2935 719.3993 722.9668 734.9711 771.9441 805.4324 822.0612 840.2185 854.8093 864.4526 895.4383 934.7778 938.0547 953.2480 953.7923 962.8784 967.0490 967.7011 977.1474 1002.9590 1004.8212 1016.9831 1043.0434 1053.9892 1054.2516 1055.0464 1055.8255 1057.7099 1075.4357 1077.2497 1078.2737 1079.7544 1086.3005 1094.2246 1133.3322 1153.5545 1181.5991 1185.7080 1203.7522 1215.4117 1224.5282 1239.9389 1270.2115 1282.7077 1307.2680 1308.7231 1331.8797 1352.8505 1365.3128 1377.8446 1400.7516 1401.1531 1401.5163 1405.5417 1418.4528 1432.7811 1455.9938 1457.4435 1458.0616 1464.9623 1488.9166 1489.8343 1492.1954 1496.1648 1503.4633 1503.8014 1505.0909 1506.7224 1507.9586 1508.2896 1523.9918 1525.3327 1537.8260 1547.0045 1578.1678 1580.7324 1609.9857 1613.5177 1635.6443 1643.1530 1661.5676 1671.4224 1733.5895 1879.0110 3027.5913 3061.9022 3066.5835 3068.0969 3070.3746 3089.8910 3128.4469 3132.5747 3132.6763 3133.4015 3141.0692 3160.0163 3175.7155 3176.2465 3176.9448 3178.4882 3187.2342 3193.7863 3204.4783 3215.0541 3215.5279 3229.8352 3250.6616 3266.1762
redmass: 1.9430 2.2364 2.5482 2.1803 1.1636 4.8260 1.7726 4.6795 1.5628 3.7077 4.6385 2.3422 2.9592 4.3153 2.2429 5.2465 6.4220 4.6461 7.2362 6.9027 3.8251 5.8839 5.2658 4.8664 6.4998 8.8071 13.4605 4.8775 6.1640 4.5147 14.4423 6.6706 6.8407 6.7129 6.1892 6.3231 5.6107 4.9556 1.8160 6.7122 8.0707 3.9042 5.5331 7.7886 6.7079 5.6782 5.7264 4.1670 7.5162 6.5046 9.5281 6.4890 5.9386 2.9489 3.3689 4.1334 3.5878 5.6655 5.1194 4.8053 4.8456 5.1530 5.2920 2.9061 5.9347 6.1908 2.9894 3.0620 3.0402 6.3613 5.5206 6.7922 2.9023 4.6212 4.9644 7.3739 4.1337 7.2621 6.9435 1.7115 5.5559 3.7010 1.6288 1.2556 4.0374 1.6871 2.5416 2.1375 6.7067 6.5785 6.8738 6.8202 1.3182 1.3726 1.3389 4.4335 5.9246 6.8105 1.4912 1.5207 1.5354 2.1715 1.4873 1.7242 1.7272 1.7240 1.7230 4.0589 2.6441 1.7863 1.8447 2.2706 1.2746 1.1275 1.3926 1.3859 1.5620 2.3363 1.8678 1.5008 1.9138 1.7883 2.8106 4.9568 1.9895 1.4547 1.4619 1.4532 1.3666 1.6148 2.7946 4.1629 4.2051 4.1682 4.3062 1.1696 1.2069 1.1656 1.1442 1.0546 1.2004 1.1104 1.6040 1.2650 1.0769 1.2165 1.5658 1.1778 2.1973 4.7689 5.0465 6.2949 6.8736 5.1097 4.8474 4.9741 8.0138 1.0991 8.9724 1.0343 1.0405 1.0367 1.0361 1.0374 1.1072 1.0880 1.0981 1.0967 1.1005 1.0971 1.1011 1.1043 1.1045 1.1052 1.1055 1.0860 1.0891 1.0930 1.0882 1.0973 1.0954 1.0926 1.0899
irintensity: 1393.5419 0.7539 0.1692 0.7125 0.6550 0.8391 1.0485 0.0753 0.7290 0.7878 2.1853 0.1174 0.3741 0.3206 0.7305 0.9854 0.0668 0.1487 0.7210 0.5199 0.2031 4.9031 1.0123 0.3134 0.0762 0.0564 0.7515 2.7396 7.9169 5.1048 1.2481 0.9220 0.6001 0.1784 0.6838 0.9447 4.1188 2.3399 2.8057 2.3797 1.7443 0.2953 3.2791 4.9253 0.4438 3.7048 2.2811 1.7601 11.0606 5.7077 42.7115 57.8733 14.4810 1.3829 9.7610 5.7648 8.7511 6.8827 30.0815 0.2056 0.9940 0.2859 1.9068 0.5338 6.4554 16.8981 0.9877 6.5133 6.5819 2.4188 18.9569 5.6408 42.2475 39.9131 111.4249 1.2013 2.1078 3.9531 17.2798 32.2261 3.3500 13.2031 21.7969 0.5820 0.4811 26.6841 49.9779 35.2322 0.6254 1.6113 0.3467 1.2997 0.1483 0.3430 0.8295 16.7853 1.1294 50.2123 1.3359 1.3997 3.4214 1.5941 4.6902 2.0067 6.4790 5.7332 3.3525 11.0007 40.4484 0.8670 56.4833 181.8900 2.4100 10.8419 217.7818 2.5395 187.3495 24.8587 400.1802 26.6561 110.7694 110.5625 5.6864 120.7046 3.7052 29.4594 63.7313 32.7427 19.1242 10.9045 51.1070 170.9574 395.8454 252.6963 26.6338 8.3747 9.5035 4.5074 102.2466 10.7277 25.2281 13.5451 1.6351 31.3829 11.1769 42.0747 74.9202 2.4163 8.3813 2.5022 4.5681 0.9486 21.3567 0.6823 111.7990 7.8689 492.0820 9.7350 287.2452 36.7529 5.3731 4.7466 3.6261 5.0433 30.5955 6.3070 2.7773 9.1115 4.6035 3.8578 33.7092 6.2446 7.7396 6.0910 4.6496 0.8884 2.6404 18.0635 0.9270 25.9993 5.4776 4.6360 5.7739
temp: 298.150 k
press: 1.00000 atm
elementType: 6 6 8 6 1 8 45 45 8 8 8 8 8 8 8 8 6 6 6 6 6 1 1 1 6 1 1 1 6 1 1 1 6 1 1 1 6 6 6 6 1 6 6 1 1 35 8 6 1 1 1 1 6 6 6 6 1 6 1 6 1 1 1
symmnumber: 1
zpe: 1211217.4 jmol-1
zpe.correction: 0.461328 hartree
zpe.thermalcorrener: 0.501880 hartree
zpe.thermalcorrenthalpy: 0.502825 hartree
zpe.thermalcorrgfe: 0.383515 hartree
zpe.sumelectzpe: -4547.257035 hartree
zpe.sumelectthermal: -4547.216483 hartree
zpe.sumelectthermalent: -4547.215539 hartree
zpe.sumelectthermalfe: -4547.334848 hartree
dipole: -0.0435 5.0127 -0.1168
dipole: 5.0142
quadrupole: -224.4743 -252.7837 -254.2334
quadrupole: -17.3616 2.1046 12.4964
quadrupole: 19.3562 -8.9533 -10.4029 -17.3616 2.1046 12.4964
hfenergy: -4547.7183631 hartree
pointgroup: C01 [X(C24H25Br1O11Rh2)]
dipole: 0.2019407 1.9622494 0.0225432 debye
polarizability: 483.8239748|-43.2337532|401.2350644|-0.2965799|18.9443961|327.6515419 unknown
InChI: InChI=1S/C16H13BrO3.4C2H3O2.2Rh/c1-19-11-7-8-13(17)12(9-11)14-15(18)20-16(21-14)10-5-3-2-4-6-10;4*1-2(3)4;;/h2-9,16H,1H3;4*1H3;;/q;4*-2;2*+4
charge 0 multiplicity 1
63 atoms
C  0.9479473 1.0541707 -0.94835633
C  0.81106374 1.19274564 -2.42911498
O  -0.09447411 2.20594015 -2.68974113
C  -0.30507139 2.89376322 -1.48832278
H  0.08834889 2.02403781 -0.62753866
O  1.33791737 0.54707666 -3.29339557
Rh -0.16782826 -0.53605194 -0.16744143
Rh -1.35860798 -2.51340491 0.65351894
O  -2.67809865 -1.20544043 1.58512639
O  -0.1432839 -2.45222265 2.32953978
O  0.04536658 -3.67799112 -0.32593458
O  -2.49418793 -2.42743965 -1.08588571
O  0.9795028 -0.63763924 1.54764883
O  -1.56275629 0.61838824 0.8184007
O  1.15339661 -1.8434082 -1.08483995
O  -1.40240572 -0.58201272 -1.83732516
C  0.9759161 -3.10167367 -0.96356893
C  -2.28101705 -1.50742746 -1.92618193
C  -2.49039205 0.04213607 1.4823944
C  0.73906925 -1.54665102 2.41034903
C  -3.16061268 -1.45772069 -3.15675012
H  -3.7081101 -2.39407935 -3.27469809
H  -3.87830799 -0.63571672 -3.04702125
H  -2.55159309 -1.25208635 -4.04109984
C  -3.43405813 0.96732414 2.2166317
H  -2.87666189 1.49209336 3.00031818
H  -3.81549964 1.72172988 1.52327625
H  -4.2546077 0.40395725 2.66340502
C  1.60571355 -1.50702937 3.64954614
H  1.42257119 -0.56640041 4.17987837
H  1.38568995 -2.35236852 4.30305826
H  2.65983978 -1.51703468 3.35568494
C  2.00262605 -3.97303342 -1.65414827
H  1.72729986 -5.02594787 -1.57826881
H  2.08476792 -3.67558783 -2.703952
H  2.98017482 -3.81258403 -1.18623292
C  2.25963249 1.27675796 -0.33863524
C  3.38480365 0.72238677 -0.98710624
C  2.44238513 1.90047929 0.90735651
C  4.63989389 0.75646465 -0.38070073
H  3.22800052 0.2247612 -1.93359132
C  3.70796959 1.97850353 1.48607648
C  4.80258006 1.39952862 0.8565706
H  3.83066177 2.48292112 2.43816359
H  5.78958485 1.43048179 1.30588956
Br 0.97144247 2.70198538 1.83071815
O  5.76206876 0.20473848 -0.91613239
C  5.63813745 -0.50737426 -2.14191233
H  5.30694509 0.14877498 -2.95753607
H  6.63571044 -0.88908075 -2.36593456
H  4.93556673 -1.34613838 -2.04835715
H  0.40260111 3.7106484 -1.3274962
C  -1.70345993 3.15917672 -1.14169234
C  -2.00660145 4.210079 -0.26014786
C  -2.73004901 2.34454415 -1.64775693
C  -3.32896501 4.45926897 0.09465968
H  -1.20396704 4.82108156 0.14449522
C  -4.05035122 2.6043206 -1.29402286
H  -2.47126474 1.51064061 -2.2885984
C  -4.35298629 3.66029911 -0.42645376
H  -3.56463031 5.27555981 0.77117129
H  -4.84750298 1.97959373 -1.68716536
H  -5.38578124 3.85782207 -0.15243586
