program: Gaussian 16
title: Title Card Required
version: ES64L-G16RevA.03
method: RB3LYP
basis: GenECP
operation: Freq
keyword: #
keyword: freq=hpmodes
keyword: rb3lyp/genecp
keyword: em=gd3
keyword: int=ultrafine
title: # freq=hpmodes rb3lyp/genecp em=gd3 int=ultrafine
converged: NO YES NO NO
title: Mulliken charges:
elementType: C C O C H O Rh Rh O O O O O O O O C C C C C H H H C H H H C H H H C H H H C C C C H C C H H Br H C H H H C H H H O
charge: -0.531669 0.700468 -0.410580 0.022077 0.296683 -0.388893 0.470974 0.504895 -0.491351 -0.498167 -0.496472 -0.494106 -0.491231 -0.510420 -0.490502 -0.501661 0.673140 0.666770 0.669415 0.666921 -0.531509 0.191696 0.183932 0.178818 -0.532549 0.171631 0.188284 0.186361 -0.533611 0.184339 0.183274 0.184622 -0.537699 0.181494 0.185947 0.187085 0.199651 -0.256847 0.054154 0.378099 0.199024 -0.147610 -0.171169 0.153345 0.147741 -0.143653 0.218470 -0.224550 0.162646 0.169731 0.166884 -0.479785 0.193068 0.191895 0.238250 -0.487752
chargesum: -0.00000
title: Mulliken charges with hydrogens summed into heavy atoms:
elementType: C C O C O Rh Rh O O O O O O O O C C C C C C C C C C C C C C Br C C O
charge: -0.234986 0.700468 -0.410580 0.240547 -0.388893 0.470974 0.504895 -0.491351 -0.498167 -0.496472 -0.494106 -0.491231 -0.510420 -0.490502 -0.501661 0.673140 0.666770 0.669415 0.666921 0.022937 0.013727 0.018623 0.016828 0.199651 -0.057822 0.054154 0.378099 0.005734 -0.023427 -0.143653 0.274712 0.143428 -0.487752
1716.lowfreq: -475.2515 0.0032 0.0063 0.0072 4.4420 5.6125 7.0216 15.0380 20.6893
frequency: -475.2515 15.0199 20.6704 33.8694 38.3979 39.9894 41.0085 42.8951 54.1230 56.5801 58.8742 61.8200 63.8113 65.0393 72.5875 78.9187 96.0223 103.2223 119.3902 130.4487 131.0097 147.9768 154.1658 154.7693 158.0071 176.4430 186.3398 195.2851 206.1565 214.4726 219.0442 235.3664 238.9625 240.7756 242.3697 249.8574 271.5938 276.9389 284.9755 286.8178 290.5857 298.4038 312.3055 315.3048 323.9739 339.2537 354.5525 369.9363 371.7434 396.0391 436.5016 456.1183 497.9232 510.5372 519.7672 572.9427 574.1109 586.3407 593.1928 605.7543 606.1970 620.0670 621.6052 622.1991 632.0149 665.8028 696.6376 698.0919 700.4469 716.8215 720.5278 724.5389 762.6038 801.1032 835.9379 886.4835 903.7937 930.0775 952.3544 953.3900 962.7867 965.5201 967.1047 990.8037 1004.4306 1039.1912 1053.2880 1054.4712 1055.2323 1056.0457 1074.9509 1076.8843 1077.4139 1078.5993 1080.0542 1103.6204 1149.0692 1162.5108 1185.8141 1200.8647 1211.8313 1224.9232 1273.5876 1295.7332 1315.4679 1345.1910 1377.2699 1397.7709 1400.9588 1401.4434 1402.4086 1406.1367 1433.4301 1441.2704 1456.0648 1457.5599 1458.8830 1465.7325 1487.7303 1488.4784 1490.5777 1493.5654 1494.6404 1498.9009 1505.0206 1506.6839 1507.1311 1507.6674 1508.4582 1524.1043 1528.0294 1539.2112 1576.2884 1579.9788 1608.9014 1618.4577 1645.4902 1670.7046 1884.0367 2089.3536 3027.1393 3037.5075 3065.0501 3066.1402 3066.3083 3067.4684 3089.2197 3131.9847 3132.9895 3134.9782 3135.6766 3137.0110 3144.1869 3159.5130 3174.7966 3175.2489 3175.6090 3175.7772 3181.5068 3215.2480 3230.0437 3269.4756
redmass: 1.9143 5.1745 5.5614 1.0818 1.1517 1.1058 1.1607 6.8559 4.9130 4.5658 2.7971 3.3396 3.0273 4.2220 6.3990 7.9832 8.2579 6.3925 4.1114 4.2906 4.7433 4.7660 6.3833 8.2346 8.0517 4.4740 5.1421 4.1367 5.3774 4.7228 1.6322 6.8649 6.1948 5.5658 6.0568 3.9858 1.8753 4.1338 6.5419 4.7553 4.8021 5.8528 6.7626 5.8693 5.8065 4.0529 6.7803 9.1109 8.8978 4.9113 3.2072 3.2001 4.6811 5.6200 5.6558 4.8084 4.8350 5.1480 5.2945 6.0693 2.9119 2.9927 3.0597 3.0659 4.7212 6.4875 5.4543 7.5741 7.6790 7.4038 4.4907 7.3464 4.1431 6.9471 1.4453 1.6569 2.9088 2.5548 6.6340 6.8315 6.9882 1.3138 7.1837 2.2488 2.6226 4.1206 1.4884 1.4880 1.4842 1.4813 1.7258 1.7366 1.7302 1.7329 4.3190 2.5152 2.5063 1.4160 1.2718 1.6609 2.1329 1.4073 2.1926 1.6994 6.6696 1.3590 4.0047 1.3292 1.4440 1.4469 1.4463 1.3628 1.8945 1.7981 4.0275 4.0546 4.1579 4.2680 1.1753 1.1763 1.1358 1.0908 1.0836 1.0524 1.1967 1.0968 1.1003 1.0970 1.1014 1.0532 1.7333 1.2902 4.9374 4.9301 6.2671 7.0328 4.8799 8.0676 10.4470 1.1018 1.0343 1.0484 1.0379 1.0374 1.0380 1.0380 1.1071 1.0994 1.0982 1.0848 1.0973 1.0972 1.0897 1.1010 1.1057 1.1056 1.1047 1.1042 1.1047 1.0881 1.0954 1.0899
irintensity: 234.4499 0.1051 0.6442 0.1183 0.4733 0.4576 0.7594 0.0917 0.8215 2.3744 0.3022 1.2469 1.3019 0.3964 2.2622 0.1615 2.1868 3.4617 0.1300 3.3600 0.2587 0.3422 0.4399 0.1700 0.3707 4.5081 4.3723 3.3849 0.0237 0.1155 2.0964 0.1014 0.2986 0.5796 0.5098 0.7684 4.2847 1.4565 4.6547 3.1793 1.0493 5.4110 0.0797 3.9749 0.6835 0.6794 13.5130 42.6901 36.3145 20.1995 6.5573 5.4964 1.7012 10.1713 3.3577 0.0834 0.0853 0.0403 2.3677 19.5180 0.6250 0.2273 7.2841 9.5562 1.2739 8.5286 16.9746 74.2740 95.4208 0.5224 4.5073 3.0510 8.3739 6.7719 23.4322 6.9122 43.2084 55.5072 0.4071 0.2162 0.1368 0.1176 0.7208 13.3341 34.2154 63.5843 2.2315 2.7378 1.1167 5.2230 2.0210 4.4447 14.0856 2.2591 19.2896 5.2240 14.8806 17.7256 0.5114 46.7065 289.9101 20.5399 198.7896 18.1745 80.0756 13.4725 140.5053 19.4013 56.5664 2.0224 69.4382 16.3223 1.8305 58.3848 199.6160 403.6394 295.1437 26.5553 0.5328 5.2980 5.7418 52.5031 62.4895 0.3352 13.6371 16.6906 42.6399 3.3171 18.5910 9.8721 112.7629 0.7913 1.7573 2.4228 1.6861 16.4614 101.4394 503.6323 288.2849 139.8908 36.2810 4.0411 4.7172 3.3354 4.6649 3.3080 31.4421 7.0145 5.5303 2.1711 5.2122 5.8659 4.7229 31.2591 5.1960 5.1189 6.4475 9.4074 1.9253 1.4874 4.8472 4.8219
temp: 298.150 k
press: 1.00000 atm
elementType: 6 6 8 6 1 8 45 45 8 8 8 8 8 8 8 8 6 6 6 6 6 1 1 1 6 1 1 1 6 1 1 1 6 1 1 1 6 6 6 6 1 6 6 1 1 35 1 6 1 1 1 6 1 1 1 8
symmnumber: 1
zpe: 1071199.7 jmol-1
zpe.correction: 0.407998 hartree
zpe.thermalcorrener: 0.445729 hartree
zpe.thermalcorrenthalpy: 0.446674 hartree
zpe.thermalcorrgfe: 0.333680 hartree
zpe.sumelectzpe: -4355.558599 hartree
zpe.sumelectthermal: -4355.520868 hartree
zpe.sumelectthermalent: -4355.519924 hartree
zpe.sumelectthermalfe: -4355.632917 hartree
dipole: 3.5304 -3.0021 1.5240
dipole: 4.8784
quadrupole: -231.1077 -202.0783 -224.3920
quadrupole: 8.8105 -9.9581 -4.8401
quadrupole: -11.9151 17.1144 -5.1993 8.8105 -9.9581 -4.8401
hfenergy: -4355.9665973 hartree
pointgroup: C01 [X(C19H23Br1O11Rh2)]
dipole: 1.3890249 -1.1810573 0.5995697 debye
polarizability: 358.6755658|19.9154138|345.5181246|-10.6777994|-10.1092466|310.8922362 unknown
InChI: InChI=1S/C11H11BrO3.4C2H3O2.2Rh/c1-6-15-11(13)10(16-6)8-5-7(14-2)3-4-9(8)12;4*1-2(3)4;;/h3-6H,1-2H3;4*1H3;;/q;4*-2;2*+4
charge 0 multiplicity 1
56 atoms
C  1.316106 -0.402177 1.296928
C  1.230438 0.05326 2.707428
O  0.896993 -1.078222 3.461989
C  1.181567 -2.146209 2.636863
H  1.009521 -1.579707 1.37822
O  1.371132 1.143523 3.183632
Rh -0.519417 0.059841 0.236123
Rh -2.541126 0.766414 -0.934426
O  -2.986934 -1.2508 -1.167355
O  -1.455368 0.712483 -2.69708
O  -1.944555 2.724081 -0.628616
O  -3.484245 0.770464 0.916175
O  0.42945 0.073387 -1.601271
O  -1.116845 -1.902917 -0.054105
O  -0.058843 2.063412 0.454721
O  -1.611995 0.069948 1.996385
C  -0.852774 2.940925 -0.022485
C  -2.834633 0.440156 1.951639
C  -2.199381 -2.122538 -0.698728
C  -0.232889 0.378557 -2.647106
C  -3.552631 0.511248 3.281027
H  -3.262013 1.439933 3.785606
H  -4.633812 0.510988 3.132302
H  -3.247809 -0.322638 3.918405
C  -2.540504 -3.578116 -0.933092
H  -2.406358 -4.146831 -0.008314
H  -3.563839 -3.679153 -1.29749
H  -1.848081 -3.987056 -1.677634
C  0.530974 0.300747 -3.950403
H  0.633914 -0.753275 -4.233184
H  -0.000024 0.833772 -4.740816
H  1.536511 0.70757 -3.814446
C  -0.416268 4.379588 0.148026
H  0.446698 4.566871 -0.501288
H  -1.224866 5.061392 -0.119782
H  -0.099115 4.546906 1.181305
C  2.51789 -0.13992 0.50384
C  3.140627 1.117157 0.651996
C  3.006272 -1.017253 -0.477025
C  4.195186 1.487821 -0.1817
H  2.736597 1.797744 1.387544
C  4.091713 -0.663933 -1.276858
C  4.68158 0.586317 -1.141491
H  4.463614 -1.365464 -2.01545
H  5.512172 0.886741 -1.771382
Br 2.207357 -2.737251 -0.740024
H  2.229988 -2.450461 2.62334
C  4.315965 3.669792 0.777185
H  4.412033 3.335761 1.818679
H  4.926429 4.561537 0.62474
H  3.263022 3.904765 0.571876
C  0.125165 -3.199855 2.582377
H  0.373343 -3.955951 1.834486
H  0.068265 -3.673923 3.573239
H  -0.839285 -2.74508 2.346558
O  4.8172 2.696868 -0.132043
