program: Gaussian 16
title: Title Card Required
version: ES64L-G16RevA.03
method: RB3LYP
basis: GenECP
operation: Freq
keyword: #
keyword: fre=hpmodes
keyword: b3lyp/genecp
keyword: em=gd3
keyword: int=ultrafine
title: # fre=hpmodes b3lyp/genecp em=gd3 int=ultrafine
converged: NO YES NO NO
title: Mulliken charges:
elementType: C C O C H O Rh Rh O O O O O O O O C C C C C H H H C H H H C H H H C H H H C C C C H C C H H Br O C H H H H C H H H
charge: -0.531230 0.698886 -0.409132 0.009575 0.300474 -0.388935 0.479891 0.501377 -0.490985 -0.498333 -0.496830 -0.496981 -0.494284 -0.512421 -0.491491 -0.496751 0.673587 0.669053 0.674852 0.667814 -0.532013 0.181668 0.190590 0.182976 -0.535129 0.178483 0.188848 0.181381 -0.533166 0.182876 0.183878 0.182910 -0.536059 0.185548 0.185858 0.180195 0.200074 -0.262892 0.055218 0.377488 0.198618 -0.147759 -0.169225 0.153921 0.148810 -0.138118 -0.487402 -0.224236 0.161610 0.170410 0.168525 0.231106 -0.462143 0.199161 0.196912 0.192947
chargesum: -0.00000
title: Mulliken charges with hydrogens summed into heavy atoms:
elementType: C C O C O Rh Rh O O O O O O O O C C C C C C C C C C C C C C Br O C C
charge: -0.230756 0.698886 -0.409132 0.240681 -0.388935 0.479891 0.501377 -0.490985 -0.498333 -0.496830 -0.496981 -0.494284 -0.512421 -0.491491 -0.496751 0.673587 0.669053 0.674852 0.667814 0.023222 0.013582 0.016498 0.015541 0.200074 -0.064274 0.055218 0.377488 0.006161 -0.020416 -0.138118 -0.487402 0.276309 0.126877
chargesum: 0.00000
1716.lowfreq: -526.7334 -6.8273 -0.0035 0.0023 0.0048 1.1860 2.4072 13.4835 17.4201
frequency: -526.7334 13.4562 17.3885 19.7268 26.3848 30.7678 38.9466 42.5613 47.6890 59.8656 60.8533 63.9369 64.5634 67.0029 75.2984 85.0298 99.1282 110.6177 121.1668 128.8132 131.3401 146.7568 151.5791 153.4602 157.3985 178.2547 185.3409 195.2931 203.7393 205.6006 215.1258 230.6544 239.1026 240.0898 241.7211 250.0066 266.6585 275.7556 284.9669 287.0531 288.7541 307.6228 312.6493 319.4557 325.5848 339.9135 350.0437 370.6357 371.5334 390.8160 447.4098 464.6035 497.4863 523.0110 545.3182 572.3436 573.1066 585.9319 592.3715 603.0669 607.4366 621.2588 622.9917 623.5148 630.8129 669.7755 696.1073 698.4044 699.5497 715.6407 723.6166 727.7403 773.0891 806.8076 838.8585 869.9837 898.5440 901.3034 931.2363 951.5496 953.4020 962.0601 966.9212 967.6746 999.4666 1029.6212 1052.4284 1053.8707 1054.5480 1055.4066 1065.1962 1075.0335 1076.9797 1077.5874 1078.7974 1093.4281 1140.3271 1161.7306 1169.6437 1185.7114 1188.8771 1224.3479 1275.1963 1304.7071 1319.5927 1355.4558 1388.3647 1399.9544 1400.8877 1402.0049 1405.5411 1410.1944 1436.5303 1446.8216 1456.4192 1457.4193 1459.6393 1465.9668 1489.8112 1490.1211 1492.8440 1497.1110 1498.4624 1504.1965 1504.3950 1505.0982 1505.5073 1505.6748 1507.7614 1524.5482 1527.8519 1539.0138 1577.0878 1579.7704 1608.9954 1616.5406 1645.9018 1670.9615 1889.9077 2149.8397 3027.9639 3045.2715 3066.6216 3066.9924 3067.5798 3069.0412 3090.3193 3123.0885 3130.6791 3131.9581 3132.9629 3135.4629 3147.9793 3160.2210 3171.0840 3175.6311 3175.7135 3175.8746 3177.0283 3215.3360 3230.0985 3267.3139
redmass: 1.6920 2.8435 2.1454 2.3842 1.1006 1.1573 1.2492 5.2994 5.0512 2.6447 3.7520 3.2344 2.7309 5.7637 7.2957 7.5456 8.0368 6.6799 3.7408 4.2952 4.6889 5.4932 8.2887 5.7573 13.1951 6.1587 3.8711 4.3115 8.4102 1.1728 6.8131 6.6502 6.8447 6.1645 6.2924 4.3140 4.1701 1.6630 7.8816 7.4416 4.2084 7.8415 6.8422 5.5238 4.8536 4.2727 8.4392 9.4008 9.5257 5.4093 3.8929 3.2620 4.4809 4.9099 6.3435 4.8180 4.8462 5.1642 5.2967 5.6858 2.9033 2.9777 3.0440 3.0414 5.2253 5.9114 7.1880 5.0952 6.7931 7.5107 7.4243 4.2580 4.1272 3.3559 1.5053 1.5736 1.6136 2.1591 3.8804 6.5535 6.7209 6.9190 6.9965 1.3193 3.2535 3.4388 1.4937 1.4915 1.4910 1.4883 3.9701 1.7218 1.7280 1.7270 1.7299 3.1469 2.9470 1.5230 2.0306 1.2775 2.2245 1.3763 2.4742 1.8551 5.0669 1.7342 2.3025 1.4712 1.4395 1.4328 1.3601 1.3257 2.1066 1.5347 4.2610 4.1213 4.0793 4.1243 1.2155 1.2124 1.1752 1.1557 1.0529 1.0753 1.0998 1.0809 1.1193 1.0745 1.0707 1.0595 1.7385 1.2757 4.7991 4.8545 6.2327 6.9305 4.8741 8.0288 11.6888 1.0859 1.0343 1.0446 1.0366 1.0363 1.0361 1.0365 1.1072 1.0919 1.1008 1.1007 1.1004 1.0998 1.0886 1.1011 1.1021 1.1046 1.1048 1.1041 1.1037 1.0882 1.0954 1.0899
irintensity: 122.6740 0.1875 0.4293 0.3491 0.5905 0.9460 0.7517 1.6028 1.2070 0.1179 0.4042 0.5398 1.1388 1.3018 0.5406 0.1539 1.0058 5.0732 0.1188 2.5031 0.7268 0.7188 0.3858 0.4945 0.6903 1.0169 7.8155 9.6136 0.0360 0.2894 0.0170 0.0031 0.2608 0.4631 0.5947 1.2471 1.7436 0.4927 2.7747 3.4175 0.1456 2.5198 0.0496 4.9429 5.4466 0.0295 12.4260 42.2402 45.3951 4.9912 7.7591 5.2239 0.5237 12.0159 3.5639 0.2145 0.0146 0.0486 2.1042 18.5739 0.4412 0.8512 7.3493 6.7610 3.1917 9.4587 82.0628 12.4426 100.5690 0.9543 4.9968 5.1542 4.5045 11.1670 22.7331 19.7674 19.8138 30.9177 29.1997 0.3397 0.0712 0.1969 0.9246 0.0783 3.9135 19.2591 3.2382 2.7642 1.4891 5.6277 68.3271 1.1987 7.2483 8.1231 2.6346 33.4245 119.9280 16.0540 75.8164 1.1423 204.0262 4.7261 118.8555 52.5987 42.2370 28.4258 104.8742 61.7555 14.2988 61.2574 21.0233 25.6579 26.0399 18.5173 277.6600 207.2156 431.4221 13.1230 13.6616 14.1734 4.5123 107.8681 3.0122 13.0680 16.3354 24.5875 15.5464 5.7853 12.3211 12.5496 116.4063 1.0660 1.7609 3.4986 1.5030 14.4910 106.6890 501.7484 283.1359 74.0914 36.5052 6.0679 5.2583 3.7875 4.0548 3.5669 30.3188 0.7625 6.2325 5.6878 4.8311 5.1884 4.3132 30.6624 2.3445 4.6250 4.6041 11.5600 6.8847 1.4285 4.5817 4.7916
temp: 298.150 k
press: 1.00000 atm
elementType: 6 6 8 6 1 8 45 45 8 8 8 8 8 8 8 8 6 6 6 6 6 1 1 1 6 1 1 1 6 1 1 1 6 1 1 1 6 6 6 6 1 6 6 1 1 35 8 6 1 1 1 1 6 1 1 1
symmnumber: 1
zpe: 1070875.2 jmol-1
zpe.correction: 0.407875 hartree
zpe.thermalcorrener: 0.445670 hartree
zpe.thermalcorrenthalpy: 0.446614 hartree
zpe.thermalcorrgfe: 0.332343 hartree
zpe.sumelectzpe: -4355.555678 hartree
zpe.sumelectthermal: -4355.517883 hartree
zpe.sumelectthermalent: -4355.516939 hartree
zpe.sumelectthermalfe: -4355.631210 hartree
dipole: 4.9557 -2.4170 1.7244
dipole: 5.7771
quadrupole: -229.7955 -203.7334 -222.0402
quadrupole: 3.8257 -6.7924 -7.9284
quadrupole: -11.2725 14.7896 -3.5171 3.8257 -6.7924 -7.9284
hfenergy: -4355.963553 hartree
pointgroup: C01 [X(C19H23Br1O11Rh2)]
dipole: 1.9497069 -0.9509435 0.6784392 debye
polarizability: 366.5180546|12.7852809|336.4828211|-3.982195|-10.6158511|314.3465734 unknown
InChI: InChI=1S/C11H11BrO3.4C2H3O2.2Rh/c1-6-15-11(13)10(16-6)8-5-7(14-2)3-4-9(8)12;4*1-2(3)4;;/h3-6H,1-2H3;4*1H3;;/q;4*-2;2*+4
charge 0 multiplicity 1
56 atoms
C  1.371733 -0.200731 1.232323
C  1.307293 0.393453 2.59098
O  1.055052 -0.674346 3.461215
C  1.41982 -1.787138 2.724799
H  1.112677 -1.368788 1.419283
O  1.411511 1.530885 2.950905
Rh -0.558956 0.068753 0.25775
Rh -2.699335 0.478524 -0.835144
O  -3.093084 -1.547477 -0.564046
O  -1.78579 0.041555 -2.64163
O  -2.134791 2.46115 -1.025258
O  -3.474469 0.889464 1.043597
O  0.224975 -0.253588 -1.628093
O  -1.094948 -1.921348 0.45027
O  -0.154157 2.081704 0.02519
O  -1.498605 0.433255 2.067081
C  -1.010756 2.822202 -0.563032
C  -2.726425 0.783425 2.060924
C  -2.235437 -2.286831 -0.001001
C  -0.544524 -0.217459 -2.643648
C  -3.322387 1.114685 3.411049
H  -3.08802 0.317954 4.122958
H  -2.860541 2.035023 3.784975
H  -4.401898 1.251635 3.33209
C  -2.56924 -3.753054 0.168779
H  -2.591457 -3.998942 1.23587
H  -3.535393 -3.982042 -0.282771
H  -1.78427 -4.359598 -0.29423
C  0.117999 -0.508755 -3.971834
H  -0.623001 -0.565989 -4.770486
H  0.839655 0.285174 -4.192392
H  0.675447 -1.44752 -3.897217
C  -0.62074 4.276207 -0.717278
H  -1.422876 4.842584 -1.192528
H  -0.394304 4.696242 0.267816
H  0.290005 4.3411 -1.322213
C  2.520098 0.029118 0.357292
C  3.136918 1.297878 0.397577
C  2.975792 -0.905865 -0.588642
C  4.150861 1.6249 -0.502124
H  2.760131 2.019896 1.107833
C  4.022584 -0.592295 -1.454316
C  4.605055 0.668192 -1.423223
H  4.369953 -1.334958 -2.16407
H  5.40379 0.934761 -2.107233
Br 2.198257 -2.651537 -0.719608
O  4.762787 2.838453 -0.554345
C  4.288461 3.865142 0.309546
H  4.430824 3.601174 1.365765
H  4.882725 4.74967 0.074004
H  3.225756 4.077507 0.132828
H  0.630529 -2.54112 2.679143
C  2.835345 -2.25498 2.847169
H  3.044324 -3.038875 2.116148
H  3.538404 -1.428884 2.706708
H  2.977325 -2.661461 3.85814
