program: Gaussian 09
title: 000033736
version: EM64L-G09RevD.01
frameworkgroup: C1[X(C13H18O2)]
method: RPBEPBE
basis: SDD
operation: Freq
keyword: #pfreq=noraman
keyword: PBEPBE/SDD
title: #p freq=noraman PBEPBE/SDD
converged: YES YES NO NO
title: Mulliken charges:
elementType: O O C C C C C C C C C C C C C H H H H H H H H H H H H H H H H H H
charge: -0.222476 -0.231998 0.168240 -0.452277 0.345909 -0.540206 -0.734074 -0.727964 0.073376 0.073259 -0.241804 -0.834770 -0.311052 0.173950 -0.786075 0.216812 0.211268 0.252573 0.236230 0.229693 0.227304 0.221190 0.228104 0.223171 0.216948 0.252993 0.280916 0.240651 0.228691 0.250138 0.256858 0.236885 0.237538
chargesum: 0.00000
title: Mulliken charges with hydrogens summed into heavy atoms:
elementType: O O C C C C C C C C C C C C C
charge: -0.222476 -0.231998 0.168240 -0.024197 0.345909 -0.051402 -0.055888 -0.059741 0.073376 0.073259 0.011189 -0.084512 -0.060914 0.173950 -0.054795
polarizability: 2.23005292e+02 1.36167465e+01 1.57763472e+02 2.09195512e+00 -5.57994986e+00 9.94078006e+01
1716.lowfreq: -11.1709 -1.3120 -0.0007 -0.0003 0.0004 8.7839 33.7563 50.4396 62.0007
frequency: 33.1869 50.2240 61.9009 76.1639 106.7927 121.1694 138.7643 184.8969 198.0340 208.6778 237.5996 249.2121 255.1154 302.8106 308.3210 324.7495 351.8025 378.9838 390.9417 421.1122 448.2103 495.3490 525.5741 533.7611 564.6938 580.0303 629.3805 676.5129 699.4836 765.8352 846.3232 871.2081 884.2245 906.7378 925.4977 932.7618 958.1192 980.4170 1000.8924 1010.3853 1019.5823 1027.4184 1035.6976 1042.6185 1101.5857 1114.9779 1143.4210 1176.2068 1190.0323 1200.4189 1235.4517 1266.1313 1288.1093 1315.1794 1324.7725 1332.2293 1348.7411 1369.4240 1379.5639 1392.4224 1400.4017 1442.3515 1444.1160 1454.8021 1457.0528 1458.4680 1467.6696 1472.4441 1480.6153 1483.7761 1489.9562 1553.9684 1567.9778 1571.4851 1636.1027 2976.8031 2976.9084 2977.9461 2978.5616 2982.2208 2982.6070 3038.9071 3056.4723 3060.2981 3064.9738 3069.4745 3071.2180 3075.7328 3080.0428 3086.1324 3101.4753 3125.6602 3160.7853
redmass: 3.1864 3.7852 5.8559 4.2931 1.0592 3.1706 2.2212 1.2615 1.8942 3.5119 1.7029 1.3929 1.4384 2.7349 2.6377 2.6675 2.8747 3.4940 2.7503 3.1288 3.6522 4.0265 2.5442 2.9480 2.6226 4.3575 4.1931 4.2285 3.5512 2.5609 2.6310 1.9199 1.8825 2.2044 1.9884 1.5819 1.9984 1.4805 1.3005 1.4369 1.8193 1.7829 1.6007 1.8751 2.1842 1.7745 2.9008 2.5302 1.8694 1.8193 2.6301 2.1396 2.3198 1.3762 1.4882 2.5125 1.6398 1.2657 1.1786 1.2225 1.1949 1.0932 1.0760 1.0507 1.0678 1.0710 1.0545 1.0637 1.0547 1.1027 1.0640 6.9123 9.6466 6.6172 5.7677 1.0390 1.0398 1.0465 1.0377 1.0499 1.0613 1.1008 1.0938 1.0963 1.0953 1.0980 1.0902 1.0975 1.0998 1.0978 1.0987 1.0993 1.0919
irintensity: 3.8781 3.2388 5.8680 3.1188 0.0982 1.3267 1.3279 0.4774 0.7814 2.1495 0.0300 0.7417 0.4307 0.4178 1.5228 1.7768 0.9835 8.7980 0.4781 1.4495 1.9262 7.3705 8.6204 11.2565 1.4281 1.3361 6.9221 5.2407 3.0904 3.7856 7.5716 1.1932 14.4886 4.5683 20.4447 1.2877 26.4664 5.5994 21.8295 12.7528 23.3113 0.9899 1.7074 36.7449 15.8580 3.0634 46.2650 4.7505 122.7767 6.0177 8.9264 37.7364 12.9241 4.7316 0.3148 287.5713 21.0425 84.3105 18.7287 35.4095 7.5999 29.0853 16.2170 13.0471 28.9228 6.1356 7.5191 7.3174 25.2027 11.0903 21.7498 19.2162 279.3556 79.7161 41.3838 14.4947 11.8945 27.3983 2.7707 25.2707 32.9453 30.1467 14.6131 12.7916 20.0076 21.1037 15.4017 38.9099 19.9040 31.2171 3.7407 18.1030 7.6995
temp: 298.150 k
press: 1.00000 atm
elementType: 8 8 6 6 6 6 6 6 6 6 6 6 6 6 6 1 1 1 1 1 1 1 1 1 1 1 1 1 1 1 1 1 1
symmnumber: 1
zpe: 724860.7 jmol-1
zpe.correction: 0.276085 hartree
zpe.thermalcorrener: 0.292616 hartree
zpe.thermalcorrenthalpy: 0.293560 hartree
zpe.thermalcorrgfe: 0.231992 hartree
zpe.sumelectzpe: -655.463764 hartree
zpe.sumelectthermal: -655.447233 hartree
zpe.sumelectthermalent: -655.446289 hartree
zpe.sumelectthermalfe: -655.507857 hartree
dipole: -0.1945 -1.0302 -1.3789
dipole: 1.7322
quadrupole: -99.1719 -96.5692 -90.4297
quadrupole: -22.9361 5.6566 0.3041
quadrupole: -3.7816 -1.1789 4.9606 -22.9361 5.6566 0.3041
hfenergy: -655.7398487 hartree
pointgroup: C01 [X(C13H18O2)]
dipole: 0.0748802 0.4106649 -0.5387086 debye
polarizability: 223.104696|13.3618118|157.5082298|-2.7481672|6.1152751|99.5636391 unknown
InChI: InChI=1S/C13H18O2/c1-9(14)5-6-11-10(2)12(15)7-8-13(11,3)4/h5-6H,7-8H2,1-4H3
charge 0 multiplicity 1
33 atoms
O  -3.003432 -2.399583 0.032613
O  3.822073 1.060236 0.615527
C  -1.163528 1.451658 -0.099413
C  -2.584941 1.175817 -0.663192
C  -0.35088 0.131248 -0.008296
C  -3.295334 0.013197 0.045773
C  -1.254181 2.092171 1.320728
C  -0.472403 2.459068 -1.064954
C  -0.958413 -1.123289 0.018687
C  -2.453026 -1.254491 0.016732
C  1.096749 0.32932 0.14342
C  -0.212908 -2.438259 0.130041
C  2.149119 -0.46319 -0.241983
C  3.554984 -0.025066 0.015014
C  4.655683 -0.954778 -0.479423
H  -2.499211 0.941236 -1.74312
H  -3.18804 2.100345 -0.581698
H  -4.27628 -0.212813 -0.407482
H  -3.49121 0.264333 1.108319
H  -1.780195 1.435491 2.036011
H  -0.251586 2.300524 1.735588
H  -1.798876 3.053072 1.265246
H  0.507341 2.80567 -0.692882
H  -0.319453 2.011086 -2.06388
H  -1.116149 3.350667 -1.185714
H  1.407498 1.277886 0.609941
H  -0.903057 -3.215959 0.494386
H  0.658314 -2.362159 0.804079
H  0.156022 -2.777369 -0.857336
H  2.010427 -1.404196 -0.782756
H  5.643868 -0.534441 -0.239354
H  4.558354 -1.953443 -0.012032
H  4.57467 -1.101988 -1.573591
