program: Gaussian 09
title: fromFREQ to TS
version: AM64L-G09RevD.01
method: UB3LYP
basis: Gen
operation: Freq
keyword: #NGeom=AllCheck
keyword: Guess=TCheck
keyword: SCRF=Check
keyword: GenChk
keyword: UB3LYP/ChkBas
keyword: Freq
title: from FREQ to TS
converged: YES YES NO NO
elementType: C
elementType: O
elementType: H
elementType: Br
1716.lowfreq: -1.4512 -0.0040 0.0033 0.0062 3.6334 4.6722 13.0396 16.1853 17.2908
frequency: 12.8951 16.1561 17.2883 22.2189 32.0401 33.1750 44.4322 50.6778 57.4781 58.4005 63.1853 64.5761 66.1630 70.5365 71.1169 87.1847 112.2498 119.5835 122.5757 132.3869 134.4172 154.0728 157.8315 158.9097 177.8847 191.5352 208.9309 213.2620 214.9015 230.3801 237.9506 239.0883 241.9780 242.7712 247.1951 264.2699 275.3666 282.7765 285.3144 295.1995 316.0004 319.2076 328.3968 337.9141 350.3860 373.8495 375.9613 387.4078 396.6266 436.0983 461.0026 495.1024 506.3667 574.1530 574.8784 580.4731 591.2695 598.5003 605.9661 611.5411 620.0064 621.4096 622.5696 654.1877 678.4573 700.5653 700.8722 721.1285 728.8455 730.4187 738.9255 802.2195 822.1246 844.2768 869.8966 911.6628 935.4780 952.7021 953.0989 964.4086 968.5119 973.7279 1014.7249 1038.1758 1044.0968 1054.8131 1055.4684 1056.5726 1057.6796 1075.6770 1077.5255 1077.8155 1078.0571 1079.1131 1095.0775 1116.2298 1157.1534 1161.5680 1184.8543 1216.3479 1227.8254 1244.9987 1300.7771 1315.0882 1332.3644 1342.1411 1382.9619 1403.7590 1404.3599 1405.1016 1407.1364 1409.0566 1444.6295 1452.3762 1459.8785 1460.9173 1461.4019 1469.1507 1485.8596 1486.7595 1489.3275 1491.9605 1507.3411 1508.7322 1509.2738 1510.0849 1511.3473 1513.0642 1522.0763 1525.3395 1529.6959 1539.8341 1568.0917 1570.5319 1601.9373 1629.0251 1655.0054 1665.7729 1932.8788 3028.8956 3062.0309 3065.3157 3066.9144 3067.3622 3067.4057 3086.0691 3091.7350 3135.4628 3136.0013 3137.5044 3139.6208 3139.7500 3143.0828 3161.9237 3173.8445 3175.7786 3176.1387 3176.5147 3200.8049 3216.2806 3231.0437 3248.4683
redmass: 7.2481 3.5695 1.2084 7.0871 1.0489 1.0243 7.5783 5.7548 3.3953 4.1634 3.7488 3.5400 4.9790 1.0975 8.9281 4.9223 4.0948 4.4574 7.9263 4.7712 4.7921 15.4030 13.1228 7.5849 5.3163 4.6157 15.3053 2.3584 6.8727 3.9198 6.6552 7.2916 6.1328 5.7895 1.1067 6.4627 1.6498 8.1009 8.1678 4.2899 6.7639 8.2661 5.7355 4.0749 22.5133 9.3845 9.3984 4.8256 4.6351 4.9095 3.4163 4.3823 4.3431 4.8254 4.8559 5.0212 5.2503 5.3428 2.9353 5.2569 2.9894 3.0737 3.0663 4.7611 6.8378 7.8941 7.8575 7.5638 6.9748 3.9414 4.5927 4.7041 4.3821 1.4789 3.1832 1.5962 4.3333 6.8616 6.8953 7.1608 7.3508 1.3195 4.1563 4.2503 2.2664 1.4830 1.4787 1.4773 1.4745 1.7309 2.1149 1.8647 1.8489 1.7441 1.8530 2.6859 1.4702 2.5843 1.2714 1.3873 1.4738 1.5188 2.5673 1.5827 3.1691 1.6595 3.0075 1.4329 1.4258 1.4275 1.3311 1.3426 1.3538 3.2532 3.9107 3.8523 3.9207 4.0678 1.1990 1.1965 1.1292 1.0813 1.2711 1.1129 1.1255 1.1288 1.1449 1.0541 1.0567 1.0457 1.4490 1.5330 4.5098 4.6015 6.0289 7.7348 5.0562 7.9260 12.9526 1.0344 1.0347 1.0385 1.0395 1.0388 1.0388 1.0824 1.1072 1.0971 1.1027 1.0969 1.0954 1.0950 1.1035 1.1010 1.1055 1.1055 1.1064 1.1064 1.0892 1.0883 1.0955 1.0898
irintensity: 0.0090 0.1841 0.1015 0.1250 0.4294 0.2300 0.4539 1.6884 0.0121 0.0889 2.4190 1.9601 0.7661 0.2490 0.0137 0.3965 1.7722 0.0168 3.7372 0.5778 4.0948 0.1545 0.1596 6.2309 5.4217 2.5984 0.1918 2.2886 0.0217 0.4861 0.0452 0.0789 0.0472 0.1056 0.0861 3.7536 0.5547 0.3319 0.5981 0.0456 0.7360 0.6312 20.0375 2.2853 8.9567 63.8321 58.5167 9.6526 4.3858 23.3339 1.6094 3.4402 6.6208 0.5619 0.6213 8.2171 0.2651 4.2607 1.3394 15.3192 0.7955 10.0970 11.3494 4.3752 0.5726 109.8565 123.4915 1.8014 0.5637 0.9644 0.6738 16.1403 48.5737 23.8364 10.1543 12.9054 46.3376 0.5619 0.6840 0.2840 0.0618 0.0287 23.3422 103.5617 17.1112 1.4213 1.1610 3.2682 7.2623 1.2089 10.5731 23.4394 17.8150 1.0883 9.1696 208.4100 28.0303 12.1238 0.7131 18.5589 5.5179 8.2688 188.7731 34.6523 2.9721 72.4495 35.0875 29.9625 60.7768 50.5054 9.6070 2.2563 11.5933 60.9742 69.8447 462.9738 448.9957 13.0831 1.2307 0.3471 2.1309 114.5865 15.0492 23.9703 23.5421 33.6199 16.8600 1.8138 1.7910 7.1067 135.3891 16.6205 0.0382 3.0569 1.4523 12.9407 150.9323 641.5961 277.1582 39.7479 7.9384 2.7816 3.2165 5.9218 0.9545 1.8635 31.9963 3.9341 7.5965 6.1814 5.2039 5.1351 13.2591 27.7783 5.2165 5.2088 5.4200 6.2464 2.0929 1.9474 4.3413 3.7126
temp: 298.150 k
press: 1.00000 atm
elementType: 6 6 8 6 1 8 45 45 8 8 8 8 8 8 8 8 6 6 6 6 6 1 1 1 6 1 1 1 6 1 1 1 6 1 1 1 6 6 6 6 1 6 6 1 1 35 1 8 6 1 1 1 6 1 1 1
symmnumber: 1
zpe: 1087954.0 jmol-1
zpe.correction: 0.414380 hartree
zpe.thermalcorrener: 0.452003 hartree
zpe.thermalcorrenthalpy: 0.452948 hartree
zpe.thermalcorrgfe: 0.337956 hartree
zpe.sumelectzpe: -4355.631948 hartree
zpe.sumelectthermal: -4355.594325 hartree
zpe.sumelectthermalent: -4355.593380 hartree
zpe.sumelectthermalfe: -4355.708372 hartree
dipole: 3.4642 -0.2831 1.0790
dipole: 3.6394
quadrupole: -222.2769 -214.5287 -216.6992
quadrupole: -0.1588 -5.2221 -3.2532
quadrupole: -4.4420 3.3062 1.1357 -0.1588 -5.2221 -3.2532
hfenergy: -4356.0463281 hartree
pointgroup: C01 [X(C19H23Br1O11Rh2)]
dipole: 1.3767617 -0.0211963 0.3927486 debye
polarizability: 355.1552115|4.2876109|321.8259656|-15.3094498|-21.5895312|255.65772 unknown
InChI: InChI=1S/C11H11BrO3.4C2H3O2.2Rh/c1-6-10(11(13)15-6)8-5-7(14-2)3-4-9(8)12;4*1-2(3)4;;/h3-6,10H,1-2H3;4*1H3;;/q;4*-2;2*+4
charge 0 multiplicity 1
56 atoms
C  2.34268542 0.12074685 -0.15588488
C  1.56587541 1.42859771 -0.23350766
O  0.75891609 1.12751494 0.86071205
C  1.5815454 -0.08860745 1.1808773
H  1.92326372 -0.55946799 -0.90585528
O  1.54928319 2.42401741 -0.89090163
Rh -1.47202555 0.48271026 0.31331694
Rh -3.58745849 -0.49211587 -0.28190725
O  -2.53793282 -1.92175051 -1.36085362
O  -3.61430474 0.74049512 -1.93444215
O  -4.50083646 0.98169342 0.82985293
O  -3.43483467 -1.67640285 1.40891317
O  -1.63016699 1.67957457 -1.35355034
O  -0.54643702 -0.97888159 -0.82842112
O  -2.50072845 1.88077316 1.42262561
O  -1.41584182 -0.79081743 1.94729018
C  -3.77281565 1.82921508 1.43968607
C  -2.40203829 -1.5769048 2.14035007
C  -1.27271675 -1.85765934 -1.40449043
C  -2.65091542 1.55479502 -2.10414261
C  -2.33929782 -2.44643009 3.37546267
H  -3.02310119 -3.29192039 3.28325013
H  -1.31563595 -2.79278454 3.53864058
H  -2.63328369 -1.84544289 4.24380997
C  -0.5437981 -2.89074704 -2.23275406
H  -0.35480101 -2.47304857 -3.22867864
H  0.42064342 -3.12713796 -1.77572967
H  -1.15221022 -3.79031613 -2.34220926
C  -2.73984819 2.48536679 -3.29125132
H  -3.32175506 3.36778534 -3.0003041
H  -1.74267479 2.81162639 -3.59276401
H  -3.25726911 1.99336755 -4.11788723
C  -4.48288287 2.85415025 2.29394823
H  -4.56308119 2.46429906 3.31554224
H  -3.90799718 3.78211172 2.32604508
H  -5.49001905 3.03314716 1.91223832
C  3.84357325 0.12262907 -0.19516105
C  4.55726285 1.31081879 -0.40717483
C  4.5618805 -1.06353697 -0.01298969
C  5.95659296 1.30894645 -0.43090376
H  3.99935697 2.22315329 -0.57341454
C  5.95772417 -1.07526451 -0.03122262
C  6.65480323 0.10761531 -0.23792766
H  6.49235982 -2.00726727 0.115088
H  7.73941144 0.12339961 -0.25861796
Br 3.63293548 -2.72123915 0.27225525
H  0.92831275 -0.9569866 1.19659784
O  6.7227077 2.41350109 -0.63224221
C  6.06945153 3.66020599 -0.84143184
H  5.46093945 3.94593283 0.02673435
H  6.86590466 4.39273175 -0.9822313
H  5.4330101 3.63622418 -1.73556251
C  2.33041797 0.10889207 2.4746908
H  1.61986637 0.20647084 3.30089705
H  2.96955406 -0.76118021 2.65730533
H  2.96098563 1.00293105 2.43698411
