program: Gaussian 09
title: 000033796
version: EM64L-G09RevD.01
frameworkgroup: C1[X(C16H16Cl2O4)]
method: RPBEPBE
basis: SDD
operation: Freq
keyword: #p
keyword: freq=noraman
keyword: PBEPBE/SDD
title: #p freq=noraman PBEPBE/SDD
converged: YES YES NO NO
title: Mulliken charges:
elementType: Cl Cl O O O O C C C C C C C C C C C C C C C C H H H H H H H H H H H H H H H H
charge: 0.049769 0.051248 -0.171304 -0.216759 -0.424319 -0.176740 -0.066166 -0.230291 -0.450473 -0.465474 -0.436982 -0.434953 -0.594829 0.021678 0.407213 0.254384 -0.589116 -0.291727 0.514676 -0.411004 -0.337262 0.162166 0.223563 0.255393 0.194084 0.209660 0.266222 0.187585 0.205456 0.215794 0.218832 0.205025 0.246752 0.235882 0.266669 0.255383 0.254757 0.395209
chargesum: 0.00000
title: Mulliken charges with hydrogens summed into heavy atoms:
elementType: Cl Cl O O O O C C C C C C C C C C C C C C C C
charge: 0.049769 0.051248 -0.171304 -0.216759 -0.029110 -0.176740 0.157398 0.025101 -0.046729 -0.011667 -0.015732 -0.011096 -0.112194 0.021678 0.407213 0.254384 -0.322446 -0.291727 0.514676 -0.411004 0.172877 0.162166
polarizability: 3.02016279e+02 -6.93555166e-01 2.25611672e+02 -4.03590070e+00 -3.82019484e+00 1.09571579e+02
1716.lowfreq: -0.0011 0.0014 0.0016 1.9442 3.6211 6.2691 19.8801 24.7175 31.8201
frequency: 19.7974 24.7087 31.8124 34.0589 53.7875 56.5998 69.2743 88.0911 97.3406 127.4188 137.5909 172.6732 177.2612 186.6141 200.9856 231.7778 240.0788 250.6950 288.7131 320.2143 343.3337 354.7953 392.0531 428.9770 495.0210 498.5461 511.8988 540.8115 548.6944 591.0777 600.3802 615.1232 618.8156 627.0481 639.4918 681.7554 702.2188 751.5084 768.9829 799.4671 811.2768 841.9062 850.1744 866.5508 880.0036 893.0908 922.1681 949.0902 961.1428 966.2728 969.0838 1004.0460 1006.9779 1032.6255 1049.1190 1064.2057 1069.1862 1102.6455 1119.5433 1127.1143 1145.3178 1168.4188 1171.7882 1192.0615 1201.7848 1208.7252 1223.2459 1232.8547 1250.5367 1257.3059 1271.3596 1274.3199 1288.3679 1292.0647 1294.9766 1302.5246 1304.7430 1344.3484 1367.0357 1383.7252 1401.0525 1431.3071 1451.6034 1457.8362 1464.7430 1472.5804 1475.6588 1491.8169 1561.8415 1591.8453 1632.2797 1710.7539 2942.8864 2958.5687 2969.2206 2973.8709 2983.5068 2985.2611 2993.3178 3009.8328 3034.7344 3038.3440 3048.3559 3050.6165 3072.7657 3095.0075 3157.2631 3529.4480
redmass: 5.5716 9.8411 6.5917 1.7848 5.0341 3.5979 8.5392 6.0915 5.5780 2.7085 2.8346 6.3150 6.7901 4.8525 20.9070 7.5604 6.9718 5.8196 5.0960 4.5057 8.1699 3.5773 10.3468 6.5219 3.0386 4.3654 1.7773 4.0990 4.8127 4.6152 6.0588 3.2824 4.1076 1.5334 4.6450 6.0562 4.9096 2.6359 1.6926 3.8327 1.7351 2.7289 2.7936 3.1878 4.0608 2.4474 1.7836 2.1743 3.4223 1.6789 1.7554 1.9013 2.9745 3.2597 3.9363 2.7104 4.0103 2.9280 1.6386 2.2368 2.5898 1.3817 1.5030 1.3126 1.5862 1.0748 1.2024 1.4234 1.5081 1.4892 1.3678 1.6790 3.1710 1.2402 1.3101 1.4820 1.5471 1.6491 2.5360 5.1983 3.9603 2.4976 1.1251 1.2789 1.0821 1.0848 1.0829 1.1000 8.3769 8.4310 11.9880 9.5047 1.0797 1.0827 1.0644 1.0554 1.0699 1.0637 1.0610 1.0653 1.1045 1.0973 1.0986 1.1024 1.1028 1.0966 1.0913 1.0644
irintensity: 0.3160 0.6712 0.3083 0.0146 0.5582 0.3039 1.8663 0.2521 1.7215 7.8957 1.5957 1.0890 1.5183 0.0985 0.1636 0.0459 1.0486 2.1232 1.0608 0.7659 0.2662 0.4031 3.5308 21.3898 7.5695 10.2039 42.4777 9.6979 7.1628 5.4061 27.2422 1.0906 7.6081 133.7133 39.0983 3.1556 22.1761 8.3323 1.8812 1.1504 0.5531 15.1659 30.6215 5.8266 1.9923 10.2549 10.8326 21.8503 58.2524 15.3482 0.9788 0.6939 24.8683 466.3129 5.8722 0.5900 1.5424 0.3061 9.3778 62.2469 124.9918 10.9850 8.7784 3.3975 6.5000 1.0432 8.3260 0.2196 129.7703 25.1524 6.4669 39.1550 199.9435 2.0104 13.2848 6.9435 10.4574 11.4588 1.5137 49.5266 89.1191 63.8932 12.6864 15.8568 2.3207 8.3319 12.4714 2.5139 60.2620 417.8984 97.0807 197.8862 1.8953 7.8483 24.6477 36.9656 62.2643 15.4758 30.8764 73.4428 12.0279 33.4542 12.9906 7.5698 75.4066 30.0632 10.3044 45.3357
temp: 298.150 k
press: 1.00000 atm
elementType: 17 17 8 8 8 8 6 6 6 6 6 6 6 6 6 6 6 6 6 6 6 6 1 1 1 1 1 1 1 1 1 1 1 1 1 1 1 1
symmnumber: 1
zpe: 753453.2 jmol-1
zpe.correction: 0.286975 hartree
zpe.thermalcorrener: 0.308280 hartree
zpe.thermalcorrenthalpy: 0.309224 hartree
zpe.thermalcorrgfe: 0.232606 hartree
zpe.sumelectzpe: -1838.686400 hartree
zpe.sumelectthermal: -1838.665095 hartree
zpe.sumelectthermalent: -1838.664151 hartree
zpe.sumelectthermalfe: -1838.740769 hartree
dipole: 0.3427 -8.0086 0.4875
dipole: 8.0307
quadrupole: -141.5049 -141.3515 -139.4051
quadrupole: -10.9571 0.5500 -0.2686
quadrupole: -0.7510 -0.5977 1.3487 -10.9571 0.5500 -0.2686
hfenergy: -1838.9733753 hartree
pointgroup: C01 [X(C16H16Cl2O4)]
dipole: -0.2198619 3.1254294 0.4072967 debye
polarizability: 302.0563578|1.3211759|224.5650152|2.0605686|11.7498136|110.5781574 unknown
InChI: InChI=1S/C16H16Cl2O4/c17-14-11(22-7-12(19)20)6-9-5-10(8-3-1-2-4-8)16(21)13(9)15(14)18/h6,8,10,19H,1-5,7H2
charge 0 multiplicity 1
38 atoms
Cl -0.126939 -3.749511 -0.367191
Cl -3.238329 -2.821853 -0.406708
O  2.615742 -2.206999 -0.11927
O  -3.631109 0.030391 -0.084306
O  -5.944762 2.808806 0.188025
O  -6.359752 0.535427 -0.14259
C  3.809336 0.616875 -0.300648
C  2.509053 0.230687 0.43998
C  4.328824 2.036137 0.064671
C  5.040383 -0.272982 0.019317
C  5.801341 2.057164 -0.439755
C  6.25687 0.555901 -0.482337
C  1.320219 1.215263 0.237102
C  1.935923 -1.165408 0.064543
C  0.088216 0.332415 0.121288
C  0.449198 -1.031195 -0.01395
C  -1.2558 0.739851 0.103861
C  -0.560327 -2.009983 -0.186291
C  -2.264804 -0.242309 -0.056926
C  -1.913351 -1.62057 -0.205468
C  -4.03852 1.419206 0.074176
C  -5.560485 1.468527 0.019186
H  3.618381 0.578862 -1.395331
H  2.747176 0.173614 1.525439
H  4.299181 2.15449 1.167523
H  3.720406 2.850417 -0.370317
H  4.970542 -1.273178 -0.435564
H  5.098696 -0.420513 1.117046
H  6.444597 2.668813 0.217954
H  5.856133 2.506375 -1.448556
H  6.518361 0.264017 -1.51621
H  7.153444 0.376314 0.137288
H  1.457879 1.79079 -0.699765
H  1.231089 1.953089 1.054295
H  -1.509866 1.798198 0.210426
H  -3.703555 1.832383 1.046391
H  -3.632663 2.056847 -0.736463
H  -6.936626 2.881239 0.155732
