program: Gaussian 09
title: 000033726
version: EM64L-G09RevD.01
frameworkgroup: C1[X(C12H10Cl2)]
method: RPBEPBE
basis: SDD
operation: Freq
keyword: #p
keyword: freq=noraman
keyword: PBEPBE/SDD
title: #p freq=noraman PBEPBE/SDD
converged: YES YES NO NO
title: Mulliken charges:
elementType: Cl Cl C C C C C C C C C C C C H H H H H H H H H H
charge: -0.089076 -0.084443 0.223266 0.308196 0.427172 0.430775 -0.457815 -0.405848 -0.366866 -0.849506 -0.426088 -0.832834 -0.254906 -0.238054 0.243211 0.239229 0.250452 0.313652 0.280169 0.243424 0.298107 0.281600 0.232530 0.233654
chargesum: 0.00000
title: Mulliken charges with hydrogens summed into heavy atoms:
elementType: Cl Cl C C C C C C C C C C C C
charge: -0.089076 -0.084443 0.223266 0.308196 0.427172 0.430775 -0.214605 -0.166619 -0.116414 -0.255685 -0.182663 -0.253127 -0.022376 -0.004400
polarizability: 2.17752478e+02 -5.47642869e+00 1.58213965e+02 -7.03214990e+00 1.35150977e+01 8.97221131e+01
1716.lowfreq: -9.0360 -6.4233 -0.0010 0.0017 0.0020 1.1681 37.9098 56.1049 60.8283
frequency: 37.8729 56.0891 60.8031 83.8518 157.4336 162.4738 234.9424 289.6469 325.2200 358.4382 413.6399 442.8574 467.9795 497.8646 511.4939 522.0824 575.5814 587.5388 634.7717 683.9391 713.3358 729.1087 762.5566 805.4053 837.5738 855.7443 859.5383 885.7437 916.4903 959.0099 978.4194 979.2652 995.5514 1035.2705 1066.3551 1115.1828 1138.2979 1162.9295 1179.1117 1202.0544 1238.4140 1241.6953 1254.8382 1260.5417 1280.6535 1364.4846 1410.3980 1420.3044 1434.2614 1463.7916 1469.5265 1499.7091 1519.9773 1578.9855 1601.3552 1631.3294 3073.1388 3087.4104 3125.2289 3126.6319 3138.6090 3149.0432 3152.1829 3155.1879 3162.5058 3169.8254
redmass: 10.5562 8.5160 6.1476 6.5814 5.2668 7.1307 4.4374 3.5702 5.7221 2.4465 3.2403 4.2712 3.7048 4.4823 4.5854 5.1483 5.7924 4.6964 4.5110 5.1366 3.7780 4.1993 1.3931 2.6237 1.5769 3.8806 2.3174 1.7914 1.5261 1.3574 1.6150 1.7992 1.3565 2.1266 2.7569 1.1841 1.2550 1.2255 1.1283 1.6712 1.7077 1.2061 1.1629 2.6486 1.7622 2.8349 3.2014 4.0992 3.6294 2.0453 1.2399 1.2256 2.9400 7.6276 6.0217 6.5510 1.0579 1.0585 1.0870 1.0865 1.0889 1.0996 1.1091 1.0958 1.1091 1.0999
irintensity: 1.4103 0.9446 1.6256 2.1917 3.6267 3.3080 4.0777 3.9305 1.6243 0.0389 2.0977 10.1813 4.6095 7.0236 29.0767 29.8182 29.3624 33.5264 27.7499 16.0941 10.9273 14.5664 62.6283 0.4038 41.8681 10.9513 12.0772 8.2024 0.4629 1.1616 1.4345 1.9262 0.4245 6.4881 1.5001 2.7116 10.9731 1.0617 2.7473 19.8059 12.0838 18.2801 14.3417 21.4414 1.1002 3.3739 0.2613 3.7434 4.6100 13.4106 14.8121 15.2470 5.9119 0.9911 5.7032 0.3248 16.3003 10.0820 1.4771 3.1207 6.2595 14.6851 6.8764 29.4876 1.1965 23.2575
temp: 298.150 k
press: 1.00000 atm
elementType: 17 17 6 6 6 6 6 6 6 6 6 6 6 6 1 1 1 1 1 1 1 1 1 1
symmnumber: 1
zpe: 480249.8 jmol-1
zpe.correction: 0.182917 hartree
zpe.thermalcorrener: 0.195138 hartree
zpe.thermalcorrenthalpy: 0.196083 hartree
zpe.thermalcorrgfe: 0.142501 hartree
zpe.sumelectzpe: -1382.430688 hartree
zpe.sumelectthermal: -1382.418467 hartree
zpe.sumelectthermalent: -1382.417523 hartree
zpe.sumelectthermalfe: -1382.471105 hartree
dipole: -2.6012 -1.6754 -0.3620
dipole: 3.1152
quadrupole: -91.0064 -93.8936 -97.7522
quadrupole: 0.8493 -5.8108 9.7168
quadrupole: 3.2110 0.3238 -3.5348 0.8493 -5.8108 9.7168
hfenergy: -1382.6136058 hartree
pointgroup: C01 [X(C12H10Cl2)]
dipole: 0.9939455 0.7065624 -0.122221 debye
dipolederiv: -0.2207154 -0.0907948 -0.0144284 -0.1926095 -0.6737348 -0.1538167 -0.1539164 -0.4174138 -0.3638649 -0.6916113 0.0804883 0.1590697 0.029308 -0.1922744 -0.0191578 0.5674129 -0.0695595 -0.4442713 0.0288836 -0.0347102 0.0286892 -0.1849047 -0.1290852 0.0020807 0.0144346 0.0276653 0.02736 0.079932 -0.0123111 0.0182212 -0.120712 -0.148126 -0.0079759 0.072687 0.1343776 -0.1205093 0.0796353 -0.076765 0.0280782 0.0422463 -0.1112701 0.0342702 0.0002751 0.0329265 0.0610956 -0.2458795 0.057005 -0.0195497 0.1215637 0.0660904 -0.0187141 -0.1848386 -0.0060185 -0.0981346 0.0287386 0.135764 0.0001656 -0.0241244 0.0758307 -0.0703658 0.0170508 -0.0407193 -0.1313763 -0.1590622 -0.1834617 0.0309577 -0.0365997 0.0106804 -0.0607005 0.0250703 -0.0342174 -0.1310063 -0.0970704 0.0369022 -0.0028669 0.0159816 0.0782585 -0.0218136 0.0370004 -0.0134717 -0.1440823 0.1556231 0.1753383 0.0471308 0.2552721 0.8155171 0.2721468 0.1268714 0.3697803 0.4318515 -0.0273475 0.0615792 -0.004806 0.1309709 0.0884977 -0.0500128 -0.0187385 -0.0528924 -0.1626012 0.9057902 -0.1503739 -0.260698 -0.0071303 0.1479917 0.0027604 -0.4904983 0.0300637 0.5468864 -0.0542346 -0.0921106 0.0209549 -0.1032616 0.1206941 -0.0486716 0.0082842 -0.0486433 -0.1413549 0.0977374 0.0877171 0.0007049 0.0907067 -0.0524639 -0.0153062 -0.0047049 -0.0194963 -0.1463849 0.0400538 -0.097351 0.0158762 -0.0449568 -0.0558818 0.0438212 -0.0037299 0.0385878 0.1416976 -0.001071 0.1107173 -0.0416092 0.0728158 -0.011103 0.0344514 -0.0307254 0.0437337 0.1349358 0.0768328 -0.0758297 0.017868 -0.0349647 -0.0504418 0.0345006 -0.0013524 0.0191271 0.1360454 -0.0166618 -0.0692072 0.0277489 0.0009969 0.0575669 -0.0669473 -0.0031695 -0.0752071 0.0230361 0.0692784 0.0892152 -0.0958799 -0.0016397 -0.0236862 -0.0129305 -0.0690835 -0.0283641 -0.0328549 0.0540223 -0.0231434 -0.0002833 -0.0967403 -0.075726 0.0443704 0.0147411 0.0495251 0.1462424 0.005018 -0.0027024 0.0473266 -0.0919551 0.0026189 -0.0590478 0.0860372 -0.0446478 -0.0082908 0.0308253 0.0160127 0.0344631 0.1007545 -0.001933 0.0841637 0.024569 0.0541447 -0.0313844 -0.0062791 0.0927023 -0.0273421 0.1091738 -0.0293871 0.0414537 -0.0260703 0.0395551 0.148597 -0.1324381 -0.0346807 -0.0097914 -0.0301914 0.0913668 0.0114412 -0.0076064 0.0111643 0.1583684 unknown
polarizability: 218.4286927|-4.5489646|160.0732895|-1.3073507|-4.5389273|87.1865748 unknown
InChI: InChI=1S/C12H10Cl2/c13-7-10-6-5-9-3-1-2-4-11(9)12(10)8-14/h1-6H,7-8H2
charge 0 multiplicity 1
24 atoms
Cl -1.421819 -3.004787 -1.054888
Cl -3.955025 0.511636 1.332081
C  0.695373 -0.306781 0.122639
C  -0.739388 -0.493269 0.096913
C  1.24426 1.009739 -0.138731
C  -1.582442 0.589273 -0.245331
C  0.354964 2.092061 -0.437606
C  -1.019798 1.882926 -0.498548
C  1.612838 -1.381424 0.380718
C  -1.337917 -1.817114 0.464336
C  2.663691 1.207632 -0.100725
C  -3.06745 0.424006 -0.379013
C  2.99179 -1.161512 0.404642
C  3.525589 0.144685 0.170195
H  0.774313 3.086862 -0.627353
H  -1.694298 2.712475 -0.738768
H  1.234516 -2.396475 0.532789
H  -2.378901 -1.746867 0.801965
H  -0.747059 -2.377211 1.199974
H  3.060672 2.211322 -0.29297
H  -3.376744 -0.549127 -0.783916
H  -3.528416 1.242034 -0.948739
H  3.674299 -1.996587 0.59594
H  4.609151 0.301501 0.196798
