program: Gaussian 09
title: 000003071
version: EM64L-G09RevD.01
frameworkgroup: C1[X(C17H14N2)]
method: RPBEPBE
basis: SDD
operation: Freq
keyword: #pfreq=noraman
keyword: PBEPBE/SDD
title: #p freq=noraman PBEPBE/SDD
converged: YES YES NO NO
title: Mulliken charges:
elementType: N N C C C C C C C C C C C C C C C C C H H H H H H H H H H H H H H
charge: -0.409778 -0.409820 -0.720257 0.463551 0.463689 0.097275 0.097553 0.214226 0.214290 -0.466562 -0.466666 -0.391582 -0.391998 -0.353035 -0.352962 -0.262423 -0.262238 -0.216861 -0.216865 0.216609 0.216474 0.268509 0.268561 0.301189 0.301195 0.239248 0.239138 0.224425 0.224432 0.216906 0.216927 0.218426 0.218424
chargesum: 0.00000
title: Mulliken charges with hydrogens summed into heavy atoms:
elementType: N N C C C C C C C C C C C C C C C C C
charge: -0.108589 -0.108625 -0.287174 0.463551 0.463689 0.097275 0.097553 0.214226 0.214290 -0.198053 -0.198105 -0.152334 -0.152860 -0.128611 -0.128530 -0.045517 -0.045311 0.001565 0.001559
polarizability: 1.98936063e+02 1.31877854e+01 1.98660684e+02 2.25762249e-02 1.18110352e-01 1.65064271e+02
1716.lowfreq: -7.0861 -1.8164 0.0002 0.0005 0.0006 9.1490 17.6561 38.1438 43.4080
frequency: 17.6188 38.1406 43.4069 127.9941 134.1197 212.8818 219.7839 221.6614 238.3851 323.7815 340.0253 421.8816 422.8767 437.3741 452.1175 493.5886 494.7698 525.3518 535.6320 571.3232 574.5538 575.7078 583.5840 615.4438 635.6449 713.9845 740.8455 747.3582 748.3388 750.3056 757.4551 761.6091 776.8119 794.7015 812.2500 850.9129 851.3277 867.2317 868.6251 930.0701 932.7825 934.6311 971.4182 971.4606 1011.1871 1011.4420 1049.7268 1067.5574 1093.5231 1093.5587 1129.6993 1132.4024 1163.5650 1166.3582 1181.2162 1230.1177 1231.2618 1249.4775 1256.9951 1283.5320 1292.7819 1328.3108 1351.5090 1354.4379 1388.2610 1389.0392 1420.3838 1420.8139 1457.8676 1458.3756 1459.6643 1483.1084 1484.0329 1559.9203 1562.0630 1585.5435 1587.1633 1631.3783 1632.2306 2955.3426 3000.3001 3121.9069 3121.9589 3132.8224 3132.9042 3148.2124 3148.3651 3162.9056 3163.0218 3214.1033 3214.1562 3614.8850 3615.0372
redmass: 5.2178 4.4713 5.1093 4.7410 4.8282 3.4886 4.9088 4.2082 2.9822 3.8898 6.5923 2.8398 2.8501 4.2360 3.1812 1.3117 1.2331 4.8634 5.3739 5.8776 3.5077 3.0368 3.4653 2.9042 4.3269 3.6356 4.1292 1.3389 1.3408 4.9449 4.7449 3.9092 2.5072 1.3966 1.9920 1.4609 1.5339 5.3267 4.9327 1.5960 1.3828 1.6839 1.3003 1.3007 2.1337 2.1038 4.6792 3.9426 1.5865 1.6180 1.4343 1.4527 1.1212 1.0964 1.2405 1.6842 2.7017 1.8077 1.4094 1.9825 2.1505 2.2797 1.5747 1.7711 5.4304 4.9634 2.3622 2.3679 2.1658 4.2380 1.4770 3.0731 2.9487 6.3979 5.9498 6.2623 6.1375 6.9795 6.9053 1.0597 1.1000 1.0849 1.0849 1.0893 1.0893 1.0949 1.0949 1.0999 1.0998 1.0981 1.0980 1.0808 1.0809
irintensity: 0.2726 0.6599 1.2571 1.3969 0.6670 7.7349 4.0830 4.4216 1.8914 1.0571 0.0035 17.6461 11.2215 1.4347 5.4669 73.8750 90.9624 11.7202 2.8677 9.1876 2.0019 10.7163 14.8515 1.5875 0.6295 0.6819 1.2077 122.2841 105.2376 4.3863 0.5887 1.9823 33.8950 33.9404 2.3976 1.4494 0.3593 1.2590 0.2126 1.3902 3.0191 8.7256 0.2690 0.0256 18.9361 7.5360 5.0537 2.9533 76.2488 3.5572 0.0036 3.5444 1.8926 2.0030 4.9080 5.2950 3.7319 20.2633 0.7373 1.4170 0.0172 16.4239 29.1181 8.0200 30.6376 36.8924 5.8749 0.0670 0.2060 31.3427 21.8742 2.4068 0.0920 8.0641 0.5853 0.4939 0.5148 3.3306 2.1781 50.2448 15.1851 0.7563 0.2158 4.6200 20.1526 37.3177 31.8735 25.8751 26.1514 1.5238 1.4780 112.6775 3.5631
temp: 298.150 k
press: 1.00000 atm
elementType: 7 7 6 6 6 6 6 6 6 6 6 6 6 6 6 6 6 6 6 1 1 1 1 1 1 1 1 1 1 1 1 1 1
symmnumber: 1
zpe: 693739.5 jmol-1
zpe.correction: 0.264231 hartree
zpe.thermalcorrener: 0.278713 hartree
zpe.thermalcorrenthalpy: 0.279657 hartree
zpe.thermalcorrgfe: 0.221326 hartree
zpe.sumelectzpe: -764.436654 hartree
zpe.sumelectthermal: -764.422173 hartree
zpe.sumelectthermalent: -764.421229 hartree
zpe.sumelectthermalfe: -764.479560 hartree
dipole: -0.0035 -0.0055 0.9722
dipole: 0.9722
quadrupole: -98.8293 -91.6774 -108.9701
quadrupole: 19.3269 0.1103 0.0992
quadrupole: 0.9963 8.1482 -9.1445 19.3269 0.1103 0.0992
hfenergy: -764.7008856 hartree
pointgroup: C01 [X(C17H14N2)]
dipole: -0.0006614 -0.0008489 -0.3824913 debye
polarizability: 193.4718996|-12.0645084|204.1239115|0.1237526|-0.2206329|165.0652075 unknown
InChI: InChI=1S/C17H14N2/c1-3-7-16-14(5-1)12(10-18-16)9-13-11-19-17-8-4-2-6-15(13)17/h1-8,10-11,18-19H,9H2
charge 0 multiplicity 1
33 atoms
N  -2.477173 2.356824 -0.602921
N  2.473581 -2.360031 -0.582706
C  0.004627 -0.001455 -2.149991
C  -1.057737 0.718253 -1.342832
C  1.061879 -0.721094 -1.336373
C  -1.920238 0.158967 -0.313117
C  1.921797 -0.159258 -0.305878
C  -2.801038 1.209689 0.130969
C  2.797838 -1.210211 0.146851
C  -1.428343 2.05457 -1.487158
C  1.429233 -2.059064 -1.472754
C  -2.036736 -1.12731 0.27974
C  2.039457 1.129696 0.280762
C  -3.781046 1.008435 1.128385
C  3.774492 -1.006593 1.147071
C  -3.01263 -1.335291 1.273261
C  3.012044 1.340045 1.277036
C  -3.876377 -0.279636 1.692979
C  3.871146 0.284094 1.705464
H  -0.478732 -0.741072 -2.820992
H  0.492211 0.738542 -2.817502
H  -1.024421 2.811666 -2.158048
H  1.026146 -2.818206 -2.141831
H  -2.925429 3.264782 -0.507973
H  2.919178 -3.268664 -0.481936
H  -1.365774 -1.937653 -0.023839
H  1.371958 1.94035 -0.029626
H  -4.444207 1.817151 1.45622
H  4.434154 -1.815382 1.481699
H  -3.11134 -2.321813 1.740099
H  3.111826 2.328638 1.73924
H  -4.624295 -0.473169 2.470334
H  4.61655 0.479499 2.484766
