program: Gaussian 09
title: 000033789
version: EM64L-G09RevD.01
frameworkgroup: C1[X(C13H13N3O6S)]
method: RPBEPBE
basis: SDD
operation: Freq
keyword: #p
keyword: freq=noraman
keyword: PBEPBE/SDD
title: #p freq=noraman PBEPBE/SDD
converged: YES YES NO NO
title: Mulliken charges:
elementType: S O O O O O O N N N C C C C C C C C C C C C C H H H H H H H H H H H H H
charge: 1.184413 -0.426856 -0.447644 -0.248387 -0.540340 -0.452364 -0.472829 -0.003302 -0.312754 0.076334 0.278204 -0.105171 0.187427 0.175078 -0.434201 -0.345733 -0.313887 -0.354840 -0.248542 -0.226140 -0.249317 -0.413206 0.124887 0.267335 0.302302 0.272214 0.235281 0.257446 0.231809 0.236293 0.268338 0.212807 0.215002 0.285208 0.391731 0.393408
chargesum: 0.00000
title: Mulliken charges with hydrogens summed into heavy atoms:
elementType: S O O O O O O N N N C C C C C C C C C C C C C
charge: 1.184413 -0.426856 -0.055913 -0.248387 -0.146932 -0.452364 -0.472829 -0.003302 -0.027546 0.076334 0.278204 -0.105171 0.187427 0.175078 -0.166866 -0.043431 -0.041673 0.137887 -0.016733 0.010153 0.231828 -0.198204 0.124887
polarizability: 5.64851363e+02 1.26487503e+01 2.71967255e+02 2.61562968e+00 -4.75572698e+00 1.31326288e+02
1716.lowfreq: -3.3425 -1.9310 -0.0017 -0.0007 0.0016 4.4986 10.5748 14.0184 15.9422
frequency: 9.8829 13.9388 15.8477 30.8615 40.5407 56.1263 80.0407 86.0567 97.4528 99.8609 136.0713 159.3931 169.8683 191.6216 201.3873 210.0835 214.6740 246.5492 269.1845 287.6803 301.4063 324.4744 336.8140 339.7563 357.8936 389.4732 408.4126 418.1365 471.5812 497.7435 499.7658 525.7765 538.3274 540.8586 560.7114 585.0338 601.8786 610.6387 633.3234 685.0357 696.6218 733.4013 775.1682 786.5968 795.0660 813.2642 834.5224 862.1623 893.1683 897.3231 915.5212 949.4127 958.5262 979.5082 983.4506 990.3923 1001.1039 1005.7395 1017.2104 1029.1306 1068.6864 1096.3893 1122.9319 1133.5533 1162.6822 1173.6799 1196.3941 1207.7935 1241.9394 1254.9532 1292.5552 1295.2909 1321.9632 1327.0809 1353.5894 1355.3552 1364.1912 1384.5171 1408.4752 1450.7634 1452.6513 1484.4068 1496.9534 1503.1896 1529.2265 1567.3808 1578.9505 1618.6185 1623.6200 2983.0640 2987.5302 3043.5064 3064.7049 3119.0671 3135.5662 3152.1118 3153.3811 3174.5854 3204.1095 3380.9891 3462.2184 3507.5609
redmass: 9.9063 8.1907 9.4940 10.6838 8.5053 6.4983 3.9540 3.8058 3.3405 3.1642 2.1489 6.4752 3.5266 6.4524 8.6180 3.1223 5.1881 4.1842 2.7238 5.7655 8.8276 7.4572 5.8484 6.9681 7.3159 9.8510 4.6770 3.6064 5.4311 3.1429 4.4109 1.9808 3.7052 3.5822 10.9386 5.4337 5.2114 4.6951 1.3786 3.6660 5.5282 4.4211 5.2499 1.4978 3.3655 1.2692 5.7425 11.8925 1.5158 1.5397 8.0554 1.5420 7.1132 7.9288 1.3549 3.9850 3.6973 1.3274 5.1157 2.0794 2.8383 1.2477 1.7832 1.7116 1.7916 1.4849 1.5465 1.2821 1.9834 1.8086 2.2804 1.4047 1.2282 2.4849 1.8582 1.6379 2.0642 3.3636 2.9744 1.2431 2.1726 1.0907 2.8282 2.0547 5.6273 5.5624 7.1590 6.2353 8.4406 1.0863 1.0553 1.0591 1.1086 1.1077 1.0869 1.0917 1.0921 1.0980 1.0937 1.0755 1.0656 1.0637
irintensity: 1.2169 0.3681 0.1556 1.5336 3.1134 1.4973 4.2227 7.9349 1.7171 10.1637 51.5595 27.0532 27.8696 6.9163 4.7887 26.7361 24.3625 0.9372 24.5690 47.3674 11.0369 33.2872 5.1960 3.5248 5.5572 30.1106 30.9236 5.9007 29.4545 2.8744 90.2228 49.0755 5.9799 7.3689 235.7430 12.0082 61.9493 71.8763 146.8476 1.9165 0.4020 2.1180 1.0755 106.7581 2.3032 7.6704 18.7324 135.4268 1.8543 22.6369 75.2123 33.2097 22.4835 64.5698 5.3907 17.4653 9.6005 0.3863 30.6634 18.0896 299.3478 211.1853 4.1915 18.9278 123.6873 174.3607 88.0074 3.6891 8.8682 20.1539 1.0920 9.7888 2.2938 97.4023 51.7001 9.0200 6.9792 38.5949 18.6145 3.7552 12.3568 12.4844 9.1887 106.6353 81.0510 125.9578 37.6084 7.9098 234.3258 49.0051 25.3499 28.3072 10.4760 10.9447 5.5974 1.5781 21.2657 14.4745 10.5636 8.4886 96.6249 53.3768
temp: 298.150 k
press: 1.00000 atm
elementType: 16 8 8 8 8 8 8 7 7 7 6 6 6 6 6 6 6 6 6 6 6 6 6 1 1 1 1 1 1 1 1 1 1 1 1 1
symmnumber: 1
zpe: 661520.7 jmol-1
zpe.correction: 0.251960 hartree
zpe.thermalcorrener: 0.275150 hartree
zpe.thermalcorrenthalpy: 0.276094 hartree
zpe.thermalcorrgfe: 0.193996 hartree
zpe.sumelectzpe: -1514.930553 hartree
zpe.sumelectthermal: -1514.907363 hartree
zpe.sumelectthermalent: -1514.906419 hartree
zpe.sumelectthermalfe: -1514.988517 hartree
dipole: 5.2686 -2.3956 -2.4644
dipole: 6.2905
quadrupole: -160.1428 -127.5660 -143.9203
quadrupole: 18.2216 20.8404 -2.1309
quadrupole: -16.2664 16.3103 -0.0439 18.2216 20.8404 -2.1309
hfenergy: -1515.182513 hartree
pointgroup: C01 [X(C13H13N3O6S1)]
dipole: 1.9174869 0.8287229 1.3271973 debye
polarizability: 563.5411687|16.5509884|263.7749688|18.1778445|35.0098481|140.8287677 unknown
InChI: InChI=1S/C13H13N3O6S/c17-13(18)11-7-9(16-12-4-2-1-3-10(11)12)8-15-14-5-6-22-23(19,20)21/h1-4,7-8,14,17,19H,5-6H2
charge 0 multiplicity 1
36 atoms
S  -6.306898 -1.044105 -1.370082
O  -5.502908 -0.319353 0.198877
O  5.825629 1.537457 -0.390126
O  4.427893 3.305675 0.09273
O  -7.090369 -2.380449 -0.402909
O  -7.493457 -0.147071 -1.959238
O  -5.144509 -1.594159 -2.337037
N  1.10686 -0.550027 0.379603
N  -2.470423 1.457008 1.36794
N  -1.334338 0.777896 1.042485
C  3.562693 -0.370203 -0.116561
C  2.323457 -1.123377 0.064243
C  3.461863 1.065689 0.055604
C  1.053245 0.797947 0.530617
C  2.216096 1.623403 0.373506
C  4.752096 -1.099341 -0.443851
C  2.3309 -2.549947 -0.089779
C  -3.712513 0.698011 1.426195
C  4.722094 -2.490349 -0.58643
C  3.507733 -3.224636 -0.409889
C  -4.24146 0.400813 -0.011843
C  -0.215688 1.457605 0.858609
C  4.569542 2.068021 -0.069602
H  2.147637 2.708594 0.501358
H  5.684972 -0.552569 -0.581682
H  1.378581 -3.068526 0.053658
H  -4.464434 1.277979 1.98644
H  -3.528209 -0.253224 1.949727
H  5.644536 -3.025359 -0.838022
H  3.506741 -4.313539 -0.527387
H  -3.503814 -0.221819 -0.551676
H  -4.418261 1.346942 -0.559066
H  -0.17848 2.561543 0.950113
H  -2.501722 2.487998 1.366498
H  6.474971 2.290807 -0.446068
H  -6.52106 -2.482534 0.416742
