program: Gaussian 09
title: Na2,XRD
version: ES64L-G09RevE.01
frameworkgroup: C1[X(C12H36N2Na2Si4)]
method: RwB97XD
basis: Gen
operation: Freq
keyword: #P
keyword: Geom=AllCheck
keyword: Guess=TCheck
keyword: SCRF=Check
keyword: GenChk
keyword: RwB97XD/ChkBas
keyword: Freq
title: Na2, XRD
converged: YES YES NO YES
title: Mulliken charges:
elementType: Na Na Si Si Si Si N N C C H H H H H H C C H H H H H H C C H H H H H H C C H H H H H H C C H H H H H H C C H H H H H H
charge: 0.659239 0.659685 1.168946 1.168946 1.168537 1.168538 -1.682752 -1.682754 -0.590195 -0.590195 0.124867 0.124867 0.128124 0.128124 0.125662 0.125662 -0.621462 -0.621463 0.126095 0.126095 0.146226 0.146227 0.117887 0.117888 -0.595200 -0.595200 0.131305 0.131305 0.131349 0.131348 0.118243 0.118244 -0.621415 -0.621416 0.126068 0.126068 0.146216 0.146216 0.117898 0.117898 -0.595207 -0.595207 0.131309 0.131309 0.131369 0.131369 0.118194 0.118194 -0.590153 -0.590153 0.124870 0.124870 0.128117 0.128117 0.125640 0.125640
chargesum: -0.00000
title: Mulliken charges with hydrogens summed into heavy atoms:
elementType: Na Na Si Si Si Si N N C C C C C C C C C C C C
charge: 0.659239 0.659685 1.168946 1.168946 1.168537 1.168538 -1.682752 -1.682754 -0.211542 -0.211542 -0.231254 -0.231254 -0.214303 -0.214303 -0.231233 -0.231233 -0.214334 -0.214334 -0.211526 -0.211526
polarizability: 2.60024384e+02 5.73520859e-04 2.52939239e+02 1.42565890e-05 2.56235385e-05 2.22591743e+02
1716.lowfreq: -0.0007 0.0007 0.0028 3.8919 9.7782 15.2426 25.5503 34.9986 36.1385
frequency: 25.5503 34.9888 36.0999 45.9902 61.1903 64.7758 72.3421 77.3867 78.1574 81.8404 87.7971 108.7708 121.0028 132.2686 133.1249 147.5675 158.5254 174.0282 177.0481 178.9586 184.4612 187.3025 192.4507 201.6036 203.4122 205.7448 206.3176 211.4204 211.6294 212.0671 213.1496 230.7302 233.8488 235.8136 236.8648 237.7339 239.0630 242.3759 243.1939 251.6822 255.7315 258.7328 259.6782 265.6333 273.4124 281.9472 358.7486 362.9487 383.9272 398.8897 583.3323 586.9629 610.7644 610.8214 668.3562 668.3680 668.7378 669.9753 670.9435 672.6211 681.7159 682.4605 682.8526 683.7635 684.3049 686.3905 694.6508 700.8021 754.6298 758.9654 767.9764 769.9609 770.8094 772.6929 788.7626 791.7038 845.0788 853.1971 855.7166 856.3086 858.4096 861.9267 862.2920 869.0422 870.8657 872.1234 915.9768 935.7099 1109.2867 1128.4695 1288.1621 1288.4624 1298.0513 1298.8219 1303.2472 1303.6664 1303.6922 1304.4735 1307.8078 1307.8588 1311.4461 1312.2377 1463.7706 1464.3815 1467.2879 1467.5854 1471.1652 1471.3838 1474.1136 1474.1682 1479.5590 1480.1401 1481.8372 1482.9556 1484.2028 1485.1907 1487.8181 1489.2674 1491.7234 1491.8984 1493.4595 1496.7825 1497.8930 1498.1251 1500.6006 1501.7721 3030.1436 3030.4114 3032.2355 3032.5245 3041.3404 3041.3822 3041.4315 3041.6139 3054.1584 3054.1618 3054.2771 3054.3104 3110.6597 3110.7898 3115.7142 3115.8495 3121.6570 3121.6902 3121.8227 3121.9091 3136.7021 3136.7323 3137.2041 3137.7141 3137.9298 3138.0198 3138.1472 3138.8181 3140.4493 3140.7363 3143.8559 3144.4591 3146.2033 3146.3897 3150.9942 3151.0038
redmass: 3.6887 3.1547 2.9990 3.4527 3.3244 4.7272 4.3988 4.7034 2.7621 3.2854 4.2832 3.5307 2.2687 1.0436 1.0504 8.6184 1.7366 2.9729 1.9507 2.5222 2.6928 2.0633 2.0596 2.2691 2.9104 1.9794 2.3408 1.0635 1.0495 1.0688 1.1422 1.3751 2.6109 2.1768 1.8993 2.8364 2.3664 1.7579 1.2430 1.1878 1.6925 1.8119 4.2520 2.1058 2.6791 2.4598 3.4451 3.5927 4.7365 4.7942 3.8056 3.7396 3.4730 3.4471 1.4581 1.2803 2.2187 2.1769 2.3999 2.0704 1.9581 2.0561 2.0358 1.2264 1.9945 1.2780 2.2843 2.2730 1.5347 1.5293 1.4602 1.4760 1.4935 1.5127 1.6153 1.5815 1.5197 1.6022 1.5891 1.5718 1.5494 1.6127 1.6371 1.7333 1.7529 1.7817 2.1496 2.3411 13.8162 13.6425 1.2674 1.2671 1.2592 1.2549 1.2700 1.2700 1.2692 1.2669 1.2501 1.2517 1.2416 1.2441 1.0518 1.0513 1.0527 1.0524 1.0527 1.0524 1.0539 1.0542 1.0520 1.0535 1.0523 1.0513 1.0526 1.0511 1.0498 1.0519 1.0499 1.0487 1.0486 1.0487 1.0488 1.0484 1.0498 1.0494 1.0412 1.0410 1.0420 1.0420 1.0368 1.0368 1.0369 1.0369 1.0362 1.0361 1.0363 1.0363 1.0960 1.0962 1.0939 1.0939 1.0989 1.0983 1.0982 1.0987 1.1010 1.1009 1.1005 1.1008 1.1006 1.1001 1.1004 1.1005 1.0987 1.0988 1.0988 1.0982 1.1005 1.1002 1.0992 1.0991
irintensity: 0.0000 0.1810 0.1950 0.2691 1.2186 3.3774 0.4709 0.2942 0.0000 0.2199 0.0000 0.3159 0.0002 0.6570 0.9739 27.9955 0.9735 4.9894 0.0003 0.0355 2.3603 13.8254 0.0000 0.0009 0.1109 1.9947 0.0017 0.0007 1.5503 0.0428 0.2244 1.7637 3.9712 0.0003 10.3207 12.0866 0.4289 0.0363 0.2503 0.0687 0.2428 0.0000 15.7931 0.0000 0.2289 2.4054 0.0001 46.6298 2.1719 77.8800 52.2127 0.0000 1.7344 19.3560 0.6352 6.0854 2.0400 10.0874 0.0026 20.5855 0.0048 3.6223 21.7854 0.0157 5.4404 0.0011 16.7202 0.0000 5.6239 4.0118 3.4795 37.4764 0.0012 3.5950 84.3555 0.0000 8.1774 205.9815 0.0008 129.5457 0.1564 26.7661 0.0653 292.3001 374.0213 0.0023 260.8774 0.0001 23.1629 1204.9686 77.7459 73.1952 25.3612 0.0006 32.7876 8.5768 107.8707 0.9306 112.6948 22.9009 77.0173 0.0001 0.0004 0.0002 0.5892 3.1650 0.0001 2.9835 0.0015 4.5879 0.0000 0.0001 2.5205 5.8092 0.7924 0.8897 0.9151 0.0010 20.3911 3.8838 1.3098 2.8844 5.1160 0.0011 9.9280 0.0003 26.8354 52.4204 2.2626 0.0215 44.1987 6.4366 6.3473 0.3231 7.1064 8.8679 12.6002 1.9261 36.8854 49.1369 29.4472 0.0014 0.1529 1.8549 0.0026 110.6645 6.6236 0.0413 0.0468 46.5612 21.4218 10.5463 54.9814 0.0036 0.1260 38.8196 24.0759 0.0002 41.3411 63.6528 5.5202 0.0053
temp: 298.150 k
press: 1.00000 atm
elementType: 11 11 14 14 14 14 7 7 6 6 1 1 1 1 1 1 6 6 1 1 1 1 1 1 6 6 1 1 1 1 1 1 6 6 1 1 1 1 1 1 6 6 1 1 1 1 1 1 6 6 1 1 1 1 1 1
symmnumber: 1
zpe: 1215370.7 jmol-1
zpe.correction: 0.462910 hartree
zpe.thermalcorrener: 0.499359 hartree
zpe.thermalcorrenthalpy: 0.500303 hartree
zpe.thermalcorrgfe: 0.396719 hartree
zpe.sumelectzpe: -2070.691693 hartree
zpe.sumelectthermal: -2070.655244 hartree
zpe.sumelectthermalent: -2070.654300 hartree
zpe.sumelectthermalfe: -2070.757884 hartree
dipole: -0.0000 -0.0000 0.0010
dipole: 0.0010
quadrupole: -176.0915 -164.7512 -149.9035
quadrupole: 0.0014 -0.0000 0.0001
quadrupole: -12.5094 -1.1691 13.6785 0.0014 -0.0000 0.0001
hfenergy: -2071.1546028 hartree
pointgroup: C01 [X(C12H36N2Na2Si4)]
dipole: 0.0000034 -0.0003832 0.0000019 debye
polarizability: 259.7583711|0.0001234|222.5917432|-1.3468403|0.0000628|253.205252 unknown
InChI: InChI=1S/2C6H18NSi2.2Na/c2*1-8(2,3)7-9(4,5)6;;/h2*1-6H3;;
charge 0 multiplicity 1
56 atoms
Na 5.30930064 8.97820339 9.94870669
Na 5.30930888 6.02847286 9.94869737
Si 7.52057428 7.73181045 7.96773187
Si 3.09803253 7.73180084 11.92967086
Si 8.10758625 7.27620736 10.94001604
Si 2.51102228 7.27618927 8.95738744
N  7.08553018 7.50330222 9.59764274
N  3.53307789 7.50328904 10.2997603
C  9.221529 8.50244093 7.65614941
C  1.39707125 8.50241814 12.24124969
H  9.37811006 9.38797911 8.28273293
H  1.2404816 9.3879498 11.61465915
H  9.32729058 8.80918101 6.60939087
H  1.29130763 8.80916545 13.28800584
H  10.0270914 7.79419221 7.87444465
H  0.5915152 7.79416027 12.0229607
C  6.25899017 8.91228523 7.15686036
C  4.35960422 8.91229026 12.74054193
H  5.22641602 8.55171654 7.24940442
H  5.39218216 8.55173151 12.6480034
H  6.45458997 9.02724488 6.08549203
H  4.16399925 9.02724998 13.81190933
H  6.31585087 9.92166267 7.59053149
H  4.30273485 9.92166684 12.30686996
C  7.46236027 6.11533476 6.97728337
C  3.15626057 6.11532952 12.92012555
H  8.18327458 5.40150126 7.39307651
H  2.43535771 5.40148552 12.50433067
H  7.71240228 6.2648942 5.92102452
H  2.90621087 6.26488942 13.97638239
H  6.47089832 5.64622961 7.01469066
H  4.14772873 5.64623681 12.88272499
C  7.24920269 6.0963394 12.17029301
C  3.36940943 6.09632615 7.72710794
H  6.25871947 6.45667538 12.47669172
H  4.35988728 6.45667115 7.42070132
H  7.83716284 5.98216751 13.08712811
H  2.78144346 5.98214826 6.81027738
H  7.13748232 5.086689 11.74809632
H  3.48114268 5.08667722 8.14930457
C  8.42984004 8.89348912 11.87702372
C  2.18875841 8.89346852 8.02037946
H  8.93913766 9.60672822 11.2181904
H  1.67945595 9.60670374 8.67921335
H  9.06204813 8.74452424 12.75947126
H  1.55655097 8.74449976 7.13793202
H  7.49846357 9.36302416 12.2183904
H  3.12013175 9.36300984 7.67901322
C  9.79947363 6.50580291 10.58213757
C  0.81913878 6.50577742 9.31526883
H  9.70615228 5.61889682 9.94496891
H  0.91246476 5.6188735 9.95243997
H  10.29599729 6.20126648 11.51041568
H  0.322616 6.20123591 8.38699196
H  10.46085928 7.21337115 10.07212021
H  0.15774988 7.21334375 9.82528454
