program: Gaussian 09
title: reactive species.
version: EM64L-G09RevA.02
frameworkgroup: C1[X(C12H36CoN2Si4)]
method: UwB97XD
basis: Gen
operation: Freq
keyword: #P
keyword: Geom=AllCheck
keyword: Guess=TCheck
keyword: SCRF=Check
keyword: GenChk
keyword: UwB97XD/ChkBas
keyword: Freq
multiplicity: 4
elementType: C H H H C H H H C H H H C H H H C H H H C H H H N Co Si Si C H H H C H H H C H H H C H H H C H H H C H H H N Si Si
converged: YES YES NO NO
title: Mulliken atomic charges:
charge: -0.581936 0.131708 0.129908 0.138916 -0.602020 0.138983 0.135248 0.130451 -0.627010 0.133143 0.149346 0.153021 -0.612089 0.126380 0.143176 0.151512 -0.600351 0.138255 0.134039 0.127175 -0.583017 0.129056 0.129881 0.135534 -1.214684 0.249334 1.141239 1.102340 -0.624744 0.152613 0.148203 0.131484 -0.601669 0.129858 0.134849 0.138669 -0.581702 0.137824 0.129345 0.131099 -0.613151 0.152156 0.143836 0.125374 -0.582824 0.135502 0.129546 0.129315 -0.600137 0.127391 0.133853 0.138177 -1.215628 1.136327 1.106894
chargesum: -0.00000
title: Mulliken charges with hydrogens summed into heavy atoms:
elementType: C C C C C C N Co Si Si C C C C C C N Si Si
charge: -0.181404 -0.197339 -0.191500 -0.191021 -0.200882 -0.188546 -1.214684 0.249334 1.141239 1.102340 -0.192445 -0.198292 -0.183433 -0.191784 -0.188461 -0.200716 -1.215628 1.136327 1.106894
charge: 0.002835 -0.000102 0.000177 0.000010 0.004467 -0.000164 0.000698 -0.000217 0.003987 -0.000524 0.005074 0.000124 0.001329 0.000582 0.002353 0.000402 0.002595 -0.000093 0.000407 -0.000129 0.002830 -0.000118 0.000495 -0.000024 0.147061 2.675593 -0.002109 -0.004028 0.004800 -0.000004 0.004628 -0.000894 0.004562 -0.000210 0.000744 -0.000147 0.001791 0.000030 0.000048 -0.000056 0.001540 0.000379 0.002779 0.000544 0.002884 -0.000031 0.000493 -0.000120 0.002258 -0.000122 0.000334 -0.000093 0.135633 -0.002128 -0.003154
polarizability: 3.00438318e+02 3.18911812e-01 2.43569547e+02 8.38887160e-02 -1.14990327e-01 2.16113683e+02
1716.lowfreq: -11.6925 0.0008 0.0014 0.0015 5.7329 7.9426 18.4112 24.0944 29.0948
frequency: 18.0866 23.7007 28.7709 43.2115 55.5455 59.4026 62.9928 67.4842 84.9809 89.2747 107.3036 112.3261 139.2538 144.4592 151.1901 156.3606 158.3450 160.1217 160.9506 164.4683 167.2921 173.2660 175.1983 177.1608 182.0611 182.4180 184.3292 186.9645 189.3229 194.8120 198.7865 201.6543 205.9724 208.4251 215.5397 226.7409 227.3121 237.1414 244.5603 248.3435 266.4687 278.2204 290.2231 360.6950 368.7837 391.9805 440.5630 619.8371 620.6324 636.7694 646.9364 679.3863 682.5657 686.6982 687.1668 687.8848 689.2235 695.8437 696.1038 697.6900 698.5081 700.0013 700.1314 731.2162 732.6459 760.3326 762.8464 769.8255 770.6394 782.9258 783.8148 832.5181 838.6362 853.0585 856.8765 864.0091 867.7213 868.3955 869.7536 874.3782 880.2420 891.9192 894.5984 902.4968 937.0765 1006.4759 1027.3688 1302.5779 1303.4921 1306.4711 1307.6643 1310.0931 1311.9790 1313.8582 1314.9864 1315.9691 1317.6011 1321.6064 1322.5112 1460.1649 1462.4469 1464.1296 1464.5247 1466.1870 1468.9620 1469.5795 1470.0125 1470.3782 1470.7515 1472.8061 1474.5002 1478.0590 1479.3309 1480.3132 1481.0330 1485.3258 1485.7177 1487.6906 1488.0032 1488.6529 1489.4621 1491.4576 1491.9387 3034.5710 3038.8916 3051.4224 3051.5291 3057.8771 3059.1581 3059.6216 3059.9681 3060.3217 3060.8541 3062.2828 3063.0538 3115.5938 3116.9548 3132.3639 3132.9416 3143.4244 3143.7439 3144.5991 3145.0800 3145.9834 3146.6175 3146.8890 3146.9816 3147.5935 3147.8625 3149.2796 3149.5155 3150.8857 3151.2710 3152.2163 3152.3787 3152.8729 3153.0731 3154.0119 3154.6052
redmass: 3.2103 3.7566 3.6177 4.4027 2.9089 5.1230 3.3387 3.5943 3.1144 3.5079 3.3494 3.7733 1.2639 2.1215 1.1279 1.3092 1.2186 1.3877 1.2511 1.2062 1.9354 1.5554 1.5516 1.7270 1.1334 1.3170 1.4047 1.2417 1.7581 1.2135 1.2723 2.2566 2.2347 2.0074 2.2414 2.3476 2.3001 2.6244 2.4975 2.7248 2.7863 2.8695 3.4654 4.3813 4.4446 3.8435 4.8867 3.4310 3.4343 3.2109 3.1797 1.2107 1.1973 1.7943 1.6869 1.4252 1.4363 1.5776 1.5721 1.9469 1.9445 2.0072 1.9643 2.5578 2.7295 1.6930 1.6836 1.5663 1.5697 1.5023 1.5026 2.1438 1.8685 1.5263 1.5499 1.6572 1.5743 1.5916 1.7142 1.7057 1.7748 1.7502 1.8299 2.3058 2.7216 13.0728 12.6247 1.2745 1.2736 1.2738 1.2731 1.2642 1.2603 1.2628 1.2662 1.2516 1.2458 1.2420 1.2422 1.0534 1.0533 1.0518 1.0512 1.0530 1.0523 1.0523 1.0525 1.0528 1.0532 1.0530 1.0539 1.0500 1.0490 1.0491 1.0481 1.0486 1.0473 1.0476 1.0466 1.0476 1.0476 1.0480 1.0469 1.0438 1.0416 1.0365 1.0365 1.0357 1.0357 1.0356 1.0356 1.0358 1.0357 1.0358 1.0359 1.0912 1.0936 1.0995 1.1000 1.1003 1.1004 1.1006 1.1005 1.1010 1.1008 1.1010 1.1009 1.1008 1.1005 1.1006 1.1010 1.1008 1.1009 1.1007 1.1002 1.1000 1.1006 1.1005 1.1001
irintensity: 0.0155 0.0459 0.0031 0.0167 0.0087 1.1693 0.0574 0.0255 0.6040 0.0065 1.1680 2.6993 2.1972 4.0737 0.1443 1.4122 0.0426 0.1112 0.0984 0.0481 0.1037 0.0397 0.1480 0.0728 0.4876 0.4349 0.8181 0.1370 0.1072 0.1040 0.4772 0.2121 9.5717 0.6815 0.8675 6.9828 1.2157 0.0660 0.0157 0.0820 0.8362 3.3180 2.1584 9.7440 39.5092 2.6141 2.0707 2.3538 7.8837 0.0405 3.6233 2.7577 2.1324 9.5248 4.1372 37.7023 1.0609 23.2446 1.4349 2.4043 1.1666 6.2571 10.6161 12.5681 47.4265 2.0525 2.9333 1.7342 2.8904 24.5797 13.2853 286.4427 1.2046 61.2908 181.1845 13.7331 1.0543 13.0029 47.0007 73.3371 260.3583 449.5035 1.2087 734.5378 2.2703 135.2787 878.5702 45.9289 44.7233 25.3470 14.8346 109.0497 96.1018 8.8800 4.4792 30.3129 55.3297 66.6721 5.5523 0.1146 1.1582 0.1729 0.2366 0.1067 2.1699 2.1287 1.9711 1.3375 2.2304 0.1102 0.1804 2.1510 9.5265 4.3977 3.2282 2.5639 3.0456 8.2171 0.8275 2.7371 0.7770 1.7283 21.9169 11.7034 14.7722 1.0495 9.6804 7.6987 10.9431 4.9258 7.3792 0.6203 0.8205 10.3085 8.5905 21.7522 27.5113 8.8253 11.6303 8.5039 5.8455 16.0590 13.5037 24.4725 31.7383 2.8586 21.5539 14.1378 13.3008 36.0885 3.8628 24.7555 47.6002 13.7776 5.1349 9.3660 5.3670 14.6037 15.4933
temp: 298.150 k
press: 1.00000 atm
elementType: 6 1 1 1 6 1 1 1 6 1 1 1 6 1 1 1 6 1 1 1 6 1 1 1 7 27 14 14 6 1 1 1 6 1 1 1 6 1 1 1 6 1 1 1 6 1 1 1 6 1 1 1 7 14 14
symmnumber: 1
zpe: 1213755.9 jmol-1
zpe.correction: 0.462295 hartree
zpe.thermalcorrener: 0.497606 hartree
zpe.thermalcorrenthalpy: 0.498550 hartree
zpe.thermalcorrgfe: 0.394064 hartree
zpe.sumelectzpe: -1891.122043 hartree
zpe.sumelectthermal: -1891.086732 hartree
zpe.sumelectthermalent: -1891.085788 hartree
zpe.sumelectthermalfe: -1891.190275 hartree
dipole: 0.0793 -0.0614 -0.3838
dipole: 0.3967
quadrupole: -161.8173 -157.6202 -160.3169
quadrupole: -1.1105 -0.0841 0.0349
quadrupole: -1.8992 2.2979 -0.3987 -1.1105 -0.0841 0.0349
hfenergy: -1891.5843387 hartree
pointgroup: C01 [X(C12H36Co1N2Si4)]
dipole: 0.0237145 -0.0180408 -0.1532103 debye
polarizability: 300.2507433|-1.0336038|243.5424062|-3.7669062|1.1770362|216.3283989 unknown
InChI: InChI=1S/2C6H18NSi2.Co/c2*1-8(2,3)7-9(4,5)6;/h2*1-6H3;/q2*-1;+2
charge 0 multiplicity 4
55 atoms
C  2.96771796 -2.65767296 0.62614562
H  3.68836617 -2.21289835 1.32006282
H  3.39188341 -3.59681791 0.25463582
H  2.06254902 -2.89520001 1.19592249
C  4.13562153 -1.12221303 -1.76710768
H  3.92803809 -0.44019574 -2.59809294
H  4.55238675 -2.04619134 -2.18221273
H  4.90960131 -0.66234934 -1.14313581
C  1.31067697 -2.2961885 -1.93090824
H  0.33879538 -2.48690916 -1.45387405
H  1.68022264 -3.27128829 -2.2669818
H  1.13305406 -1.68556235 -2.8235045
C  1.3834385 2.38622241 1.45740427
H  0.59976243 2.79195995 0.80627365
H  1.86528965 3.24123109 1.94417686
H  0.89781312 1.78993312 2.23856053
C  3.99576968 0.80130766 1.70322278
H  3.57182845 0.17869556 2.49797208
H  4.49001778 1.65900779 2.17201
H  4.7684177 0.21362541 1.19530229
C  3.43113035 2.45176759 -0.8221221
H  4.19216561 1.90240557 -1.38583799
H  3.90892817 3.33562107 -0.38547073
H  2.67326711 2.79470025 -1.53484323
N  1.83595343 -0.00432009 -0.19569468
Co -0.01536945 -0.00935825 -0.29373033
Si 2.56889531 -1.46763832 -0.77851624
Si 2.65297028 1.36010248 0.50272505
C  -1.43106411 2.4413129 -1.59067658
H  -1.3646525 1.93120291 -2.55813587
H  -1.79249651 3.45879818 -1.77635725
H  -0.41002336 2.54858005 -1.19697567
C  -4.25261553 1.2824546 -1.2934333
H  -4.9805599 0.78270627 -0.64500726
H  -4.68398781 2.24332724 -1.59416034
H  -4.12988546 0.66902373 -2.19200072
C  -2.86393212 2.58054666 1.11920845
H  -1.91080168 2.76232618 1.62792779
H  -3.30763575 3.55100106 0.87147489
H  -3.52781447 2.07780118 1.8300244
C  -1.28760465 -2.52501571 1.34758857
H  -0.73439009 -2.00870918 2.14064103
H  -1.7296885 -3.42695075 1.78482617
H  -0.56376902 -2.8611807 0.59466121
C  -3.53936015 -2.37555642 -0.72708156
H  -2.85467453 -2.65956835 -1.53358848
H  -3.98954619 -3.29086115 -0.32749342
H  -4.33936526 -1.7721936 -1.16833537
C  -3.84585061 -0.95373507 1.97528781
H  -4.65014218 -0.31414264 1.5951452
H  -4.31126211 -1.84595548 2.40774407
H  -3.34086709 -0.41061163 2.78091878
N  -1.85259977 0.00111487 -0.03666574
Si -2.60165176 1.52075579 -0.41619877
Si -2.6272153 -1.41082221 0.61062777
