program: Gaussian 16
title: CEJ-2015 3-TS[D-R]
version: ES64L-G16RevC.01
frameworkgroup: C1[X(C26H27NO4PdS2)]
method: RM06
basis: Gen
operation: Freq
keyword: #p
keyword: freq=noraman
keyword: gen
keyword: scrf=(smd,solvent=toluene)
keyword: integral=grid=ultrafine
keyword: m06
keyword: pseudo=read
title: #p freq=noraman gen scrf=(smd,solvent=toluene) integral=grid=ultrafine
basis: NPDir=0 NMtPBC= 1 NCelOv= 1 NCel= 1 NClECP= 1 NCelD= 1
basis: NCelK= 1 NCelE2= 1 NClLst= 1 CellRange= 0.0.
basis: One-electron integrals computed using PRISM.
basis: One-electron integral symmetry used in STVInt
basis: 1 Symmetry operations used in ECPInt.
basis: ECPInt: NShTT= 25878 NPrTT= 141964 LenC2= 20166 LenP2D= 61711.
basis: LDataN: DoStor=T MaxTD1= 5 Len= 102
basis: NBasis= 643 RedAO= T EigKep= 2.00D-04 NBF= 643
basis: NBsUse= 643 1.00D-06 EigRej= -1.00D+00 NBFU= 643
converged: YES YES NO YES
title: Mulliken charges:
elementType: Pd C C C C C C H H H C C H H C C H C C C C C C C H C C H C H H H H O N C O C H H H S O C H H H C H H H S O C H H H C H H H
charge: -0.049953 -0.137493 -0.174416 0.092006 0.066756 -0.141685 -0.144161 0.132634 0.134017 0.128863 -0.177967 0.011662 0.132678 0.135106 0.212413 -0.136599 0.115067 -0.121642 0.089953 0.431668 -0.154260 0.077532 -0.156667 -0.141872 0.113183 -0.171037 -0.165687 0.111234 -0.146445 0.128776 0.125994 0.129239 0.128027 -0.717301 -0.625698 0.593336 -0.627811 -0.440701 0.168655 0.159929 0.130696 0.964582 -0.679835 -0.551231 0.188616 0.250602 0.200277 -0.561948 0.251247 0.197935 0.203493 0.924258 -0.697708 -0.561390 0.251394 0.205171 0.202444 -0.541205 0.212257 0.225144 0.197872
chargesum: -0.00000
title: Mulliken charges with hydrogens summed into heavy atoms:
elementType: Pd C C C C C C C C C C C C C C C C C C C C O N C O C S O C C S O C C
charge: -0.049953 -0.003476 -0.045553 0.092006 0.066756 -0.009008 -0.009056 -0.045333 0.011662 0.212413 -0.021532 -0.121642 0.089953 0.431668 -0.041077 0.077532 -0.045434 -0.013096 -0.045043 -0.036447 -0.018418 -0.717301 -0.625698 0.593336 -0.627811 0.018579 0.964582 -0.679835 0.088263 0.090727 0.924258 -0.697708 0.097618 0.094069
polarizability: 6.60037985e+02 1.01116853e+01 4.83731025e+02 7.18659965e+00 1.91041360e+01 3.78695484e+02
1716.lowfreq: -8.2761 -4.4418 -0.0017 -0.0012 -0.0008 8.0764 20.7275 27.6994 38.7825
frequency: 20.5601 27.3721 38.6182 48.9867 52.1331 54.6194 61.5987 69.6617 73.0385 92.1852 95.0546 103.3754 112.6953 120.5095 128.5951 140.7419 153.2235 157.2118 161.6205 163.0938 170.2545 186.2993 189.3578 203.8256 210.5998 223.1209 229.0609 232.2216 247.4701 251.6622 276.0025 285.8069 295.9076 303.0005 320.7505 329.8584 339.6832 345.8559 361.3972 376.3117 381.6723 393.1246 407.0471 422.8123 437.0633 437.4168 470.0819 496.2425 510.5182 520.5930 529.1327 539.6013 549.6345 557.9931 569.6597 593.4213 603.3298 623.3900 638.9008 683.1409 690.5588 690.8390 693.7684 701.4229 739.5741 741.5032 749.5278 751.2876 761.8075 774.1490 784.7053 795.4733 806.3716 835.5979 836.2383 858.1282 870.1563 874.1022 900.2821 913.2056 921.7443 938.5391 945.6266 946.0091 947.7132 950.8911 959.6711 961.8781 982.2979 984.1326 986.4193 988.7855 996.0532 1021.1441 1031.8832 1033.0311 1040.8801 1043.9438 1058.4423 1063.8293 1092.6098 1132.2135 1136.1968 1144.8401 1149.1107 1150.6581 1156.2937 1157.8706 1201.7295 1234.9940 1236.2682 1255.2079 1268.5568 1277.2834 1308.2825 1312.9267 1313.2429 1330.4517 1331.1760 1361.8226 1364.1335 1378.5410 1386.3034 1390.1752 1401.7169 1403.6094 1405.4712 1409.1408 1417.0149 1421.4518 1422.9623 1427.4524 1431.8190 1432.4890 1437.4516 1442.7247 1460.3618 1465.9340 1469.4281 1490.5061 1506.4004 1556.1732 1560.8768 1620.9612 1627.4403 1653.3043 1656.4715 1686.6263 1687.1598 1693.6293 3036.0090 3038.3796 3045.9042 3049.0665 3055.3908 3135.8527 3156.9269 3159.6369 3161.5257 3163.6392 3164.3019 3164.4095 3165.9951 3167.2431 3168.9983 3174.0738 3174.3429 3177.2488 3179.3140 3179.8112 3180.1965 3183.8305 3189.6680 3190.0953 3191.3456 3196.5401 3200.1782
redmass: 6.6223 5.2973 4.6479 5.2342 4.5530 4.7710 4.6780 4.9439 4.9317 6.1340 3.7419 4.6807 5.8435 1.3661 5.8521 2.3391 2.7783 4.6525 3.9420 4.5446 1.6305 4.5538 3.4900 4.8425 2.9738 3.5407 1.4351 2.6230 2.9615 1.4929 1.4118 4.0670 2.4309 2.5463 5.4912 6.5642 4.6152 4.6702 5.6979 5.9589 4.6491 4.1783 3.8118 3.6918 3.9889 5.3002 6.2641 5.0133 3.7626 5.4043 5.0773 6.5889 4.4254 3.8244 4.1010 3.7242 3.3812 5.2710 6.0566 5.1445 3.7865 4.6630 4.7352 3.1725 3.9381 3.8606 6.8193 1.5303 1.3663 3.6668 3.2564 3.0963 3.9838 1.9142 2.1160 4.2184 1.5458 1.6189 4.8763 1.2555 1.2344 5.6061 1.3832 1.3892 1.2939 1.2966 1.3430 1.3533 1.4584 1.2630 1.4627 1.2953 5.9158 1.6032 1.5354 1.6064 1.4191 3.6453 2.0159 2.1031 2.1199 1.3373 9.3352 8.4999 1.2097 1.1986 1.1237 1.1337 1.7099 1.8558 1.8164 2.6517 2.1905 1.9255 2.9101 1.2865 1.1972 1.1924 1.1990 1.4431 2.9828 3.1868 1.0706 1.0801 1.4300 1.0536 1.7768 1.0979 2.3016 1.0605 3.7922 4.1951 1.0632 2.3897 1.0491 1.1693 1.7535 3.7814 3.2668 3.1265 4.1534 4.2181 4.5488 8.5412 8.6075 7.0189 6.8778 7.3640 7.4593 8.2592 1.0297 1.0295 1.0373 1.0298 1.0302 1.1007 1.1049 1.0879 1.1073 1.0881 1.1060 1.0876 1.1070 1.0872 1.1074 1.0879 1.1078 1.0973 1.0890 1.1076 1.0972 1.1078 1.0930 1.1072 1.0943 1.0984 1.0976
irintensity: 1.7790 0.5213 2.3322 0.7902 3.5246 0.5809 0.9963 1.4352 9.8837 2.8749 1.3092 6.8978 13.7973 3.9407 3.0766 2.4526 2.6692 7.2307 10.0902 9.2094 0.4411 6.5139 0.3629 1.6306 8.1259 3.0611 0.9453 3.9519 6.1003 5.9062 9.3844 11.5653 1.8191 1.6378 6.1912 22.0643 16.1843 10.3208 5.4945 0.7647 2.5601 51.4906 10.5952 4.7696 3.3453 7.8710 4.3360 20.0755 1.6040 2.4536 4.0135 1.3009 19.8582 2.9515 5.7099 6.5574 17.6520 0.3804 4.9685 19.2756 11.3450 10.1552 7.3320 3.4902 16.4495 12.3578 10.1165 25.3333 30.7329 2.4477 4.7395 12.3537 3.2869 37.8932 27.2178 0.4909 4.3769 2.8878 8.7908 7.8546 8.5485 3.2663 10.7307 8.5452 0.3368 0.4830 2.1957 1.1369 29.4157 0.2380 30.0509 0.6937 22.1354 5.2865 83.6275 69.6956 187.7677 4.0113 8.7790 6.3097 10.1672 16.8324 267.8138 367.5188 8.9885 6.7625 0.8542 1.2470 1.8356 4.1282 9.6229 18.4295 35.4023 1.9758 137.1364 30.9119 10.9844 37.4939 6.1152 5.1962 15.2336 93.9674 16.2082 19.0448 26.5255 12.4331 48.0004 10.1949 158.4743 2.0059 17.4608 10.8118 16.5885 19.8917 39.0868 7.5987 67.9433 55.2198 24.2655 75.1682 43.1987 38.8342 28.4336 19.9262 2.1531 34.6411 41.4692 103.5616 126.5505 170.7423 8.0053 3.0737 10.1610 6.9849 4.1592 5.6623 12.2338 9.4317 12.6087 6.5243 4.3548 13.2971 0.0582 7.4563 8.5791 9.9792 1.6522 36.1269 7.3699 0.8430 35.0930 4.9868 30.5871 3.0847 29.0505 39.8651 26.0475
temp: 298.150 k
press: 1.00000 atm
elementType: 46 6 6 6 6 6 6 1 1 1 6 6 1 1 6 6 1 6 6 6 6 6 6 6 1 6 6 1 6 1 1 1 1 8 7 6 8 6 1 1 1 16 8 6 1 1 1 6 1 1 1 16 8 6 1 1 1 6 1 1 1
symmnumber: 1
zpe: 1241120.4 jmol-1
zpe.correction: 0.472718 hartree
zpe.thermalcorrener: 0.507191 hartree
zpe.thermalcorrenthalpy: 0.508135 hartree
zpe.thermalcorrgfe: 0.406667 hartree
zpe.sumelectzpe: -2284.359821 hartree
zpe.sumelectthermal: -2284.325349 hartree
zpe.sumelectthermalent: -2284.324404 hartree
zpe.sumelectthermalfe: -2284.425872 hartree
dipole: 0.9520 3.4452 -0.7112
dipole: 3.6444
quadrupole: -224.8776 -210.6372 -205.1921
quadrupole: 2.6370 -1.4361 24.8439
quadrupole: -11.3086 2.9317 8.3769 2.6370 -1.4361 24.8439
hfenergy: -2284.8325392 hartree
pointgroup: C01 [X(C26H27N1O4Pd1S2)]
dipole: -0.3745425 -1.3554606 -0.2797885 debye
polarizability: 660.0379841|10.1116899|483.731026|-7.1865992|-19.1041362|378.695484 unknown
InChI: InChI=1S/C22H15NO2.2C2H6OS.Pd/c1-14(24)23-19-12-10-15-6-2-4-8-17(15)21(19)22-18-9-5-3-7-16(18)11-13-20(22)25;2*1-4(2)3;/h2-13H,1H3;2*1-2H3;/q-2;2*+1;
charge 0 multiplicity 1
61 atoms
Pd -1.653794 0.043574 -0.113469
C  4.265998 -3.897855 -1.42514
C  3.301405 -4.186463 -0.493531
C  2.445631 -3.174852 0.004524
C  2.602456 -1.832317 -0.460084
C  3.60603 -1.571618 -1.430104
C  4.412211 -2.576924 -1.901571
H  1.320221 -4.491201 1.299415
H  4.916502 -4.68392 -1.802009
H  3.172065 -5.202791 -0.123136
C  1.430288 -3.467023 0.945564
C  1.755957 -0.804804 0.048766
H  3.723338 -0.556047 -1.801046
H  5.171658 -2.355163 -2.648009
C  0.748856 -1.141584 0.946563
C  0.595868 -2.477704 1.391586
H  -0.198351 -2.691471 2.106246
C  1.879325 0.609714 -0.394865
C  2.983913 1.417561 0.001361
C  0.838998 1.170722 -1.140563
C  4.043308 0.921878 0.80989
C  3.043345 2.786898 -0.404966
C  0.916903 2.538734 -1.527424
C  5.092022 1.726699 1.181606
H  4.012928 -0.113928 1.142072
C  4.142407 3.585929 -0.013206
C  1.984826 3.317406 -1.181261
H  0.087275 2.941122 -2.108021
C  5.150966 3.073446 0.764021
H  5.886854 1.320784 1.804074
H  4.165422 4.625702 -0.338419
H  2.031041 4.363046 -1.484054
H  5.9893 3.698973 1.061837
O  -0.223554 0.4731 -1.527985
N  -0.221543 -0.1954 1.336657
C  -0.027618 0.850589 2.172074
O  -0.843048 1.77938 2.256931
C  1.189214 0.829277 3.064746
H  1.945411 1.506732 2.649626
H  0.904968 1.215774 4.047708
H  1.639851 -0.162355 3.170917
S  -3.403537 -0.316021 1.394292
O  -4.546784 0.642137 1.281816
C  -2.921291 -0.420955 3.115089
H  -2.138198 -1.177012 3.223697
H  -2.540383 0.56494 3.393916
H  -3.818043 -0.681662 3.686677
C  -4.022665 -1.975402 1.114578
H  -4.393192 -1.998446 0.083717
H  -3.198473 -2.68609 1.24179
H  -4.835017 -2.168893 1.823195
S  -3.233252 0.233097 -1.886535
O  -4.352958 -0.761795 -1.957241
C  -3.916004 1.886069 -1.784855
H  -4.453041 1.943449 -0.832006
H  -3.085129 2.600866 -1.793142
H  -4.595105 2.041887 -2.629675
C  -2.430964 0.294975 -3.48692
H  -1.656279 1.065395 -3.470327
H  -1.970552 -0.681159 -3.65854
H  -3.208641 0.49466 -4.231072
