program: Gaussian 16
title: CEJ-2015 3-TS[D-R]
version: ES64L-G16RevC.01
frameworkgroup: C1[X(C23H26CsF3N2O5PdS)]
method: RM06
basis: Gen
operation: Freq
keyword: #p
keyword: freq=noraman
keyword: gen
keyword: scrf=(smd,solvent=toluene)
keyword: integral=grid=ultrafine
keyword: m06
keyword: pseudo=read
title: #p freq=noraman gen scrf=(smd,solvent=toluene) integral=grid=ultrafine
basis: NPDir=0 NMtPBC= 1 NCelOv= 1 NCel= 1 NClECP= 1 NCelD= 1
basis: NCelK= 1 NCelE2= 1 NClLst= 1 CellRange= 0.0.
basis: One-electron integrals computed using PRISM.
basis: One-electron integral symmetry used in STVInt
basis: 1 Symmetry operations used in ECPInt.
basis: ECPInt: NShTT= 28203 NPrTT= 151154 LenC2= 22068 LenP2D= 68176.
basis: LDataN: DoStor=T MaxTD1= 5 Len= 102
basis: NBasis= 676 RedAO= T EigKep= 4.47D-04 NBF= 676
basis: NBsUse= 676 1.00D-06 EigRej= -1.00D+00 NBFU= 676
converged: YES YES NO YES
title: Mulliken charges:
elementType: S F F F O O N C H C C C H C H C H C C C H C H C H C H C C H H H Pd C C O O H N C O C C C H H H H H H H Cs C H H H C H H C H H
charge: 1.541163 -0.329958 -0.349141 -0.329855 -0.740223 -0.759082 -0.715772 0.109246 0.142503 0.161161 -0.113054 -0.122591 0.145939 -0.117725 0.139978 -0.055035 0.134198 -0.335750 0.097734 -0.155787 0.114006 -0.132173 0.131558 -0.135252 0.129978 -0.134665 0.131397 -0.150469 0.793440 0.127064 0.108488 0.374465 0.234279 -0.034374 0.685246 -0.594854 -0.679776 0.133247 -0.525102 0.585846 -0.609674 -0.071972 -0.362313 -0.379828 0.142706 0.133011 0.125502 0.150729 0.118042 0.126700 0.131586 0.933987 -0.445890 0.179471 0.175916 0.137427 -0.308891 0.164858 0.135782 -0.295651 0.123065 0.185140
chargesum: -0.00000
title: Mulliken charges with hydrogens summed into heavy atoms:
elementType: S F F F O O N C C C C C C C C C C C C C C Pd C C O O N C O C C C Cs C C C
charge: 1.541163 -0.329958 -0.349141 -0.329855 -0.740223 -0.759082 -0.715772 0.251749 0.161161 -0.004565 0.023348 0.022253 0.079164 0.038715 0.097734 -0.041781 -0.000615 -0.005274 -0.003268 -0.023405 0.793440 0.234279 0.098872 0.685246 -0.594854 -0.679776 -0.525102 0.585846 -0.609674 0.070734 0.046929 -0.003502 0.933987 0.046924 -0.008251 0.012554
chargesum: 0.00000
polarizability: 5.13100347e+02 2.06399228e+00 3.72623452e+02 -1.37138079e+01 3.15264605e+01 3.51575205e+02
1716.lowfreq: -1496.2008 -4.2852 0.0012 0.0013 0.0017 5.0689 9.8407 15.8494 32.0320
frequency: -1496.2008 15.0028 31.9229 32.6482 41.5591 48.8453 55.0458 66.1390 68.8209 70.6051 82.8357 88.8927 91.0276 98.1385 105.9346 111.3151 115.1210 120.7624 125.0747 132.1946 145.4018 151.3181 169.8468 174.5532 185.0865 191.6227 196.1284 216.3325 224.7851 242.4487 246.6703 253.4180 274.9664 280.2685 292.9621 296.8714 301.6532 313.2093 322.3277 333.6668 350.8847 357.2965 377.8678 383.5427 405.7026 411.3579 419.7198 430.3289 448.8558 461.5166 481.1090 498.5086 508.7617 518.0582 538.4038 547.8469 561.8945 568.5592 571.9557 596.5889 614.3987 626.2609 632.0298 664.3649 668.0004 685.4362 709.4594 717.1630 747.3380 762.0373 765.6009 770.6446 782.8623 810.0661 849.2823 850.8351 853.6201 855.9171 879.2476 896.1724 913.9524 918.6112 921.1532 944.1460 949.4818 964.3485 966.9834 972.1316 991.3681 991.6948 996.6472 1007.2375 1017.9546 1023.8882 1039.7917 1041.9815 1056.7893 1061.8075 1063.5817 1076.6363 1094.7127 1100.8645 1119.0341 1134.4904 1155.1702 1156.9780 1160.0226 1165.7614 1167.7605 1180.3562 1183.7671 1201.8911 1210.0004 1212.1987 1213.8054 1219.1069 1231.9984 1243.0113 1244.8229 1254.9413 1284.3194 1300.5650 1302.4983 1322.7601 1327.3593 1332.5883 1334.9431 1353.1040 1354.3029 1367.1975 1376.7972 1377.2188 1388.6990 1391.0249 1401.2191 1423.4062 1438.7632 1449.2835 1454.1429 1456.0085 1457.8781 1467.4647 1472.3827 1476.4537 1479.8825 1490.0063 1500.6928 1515.9011 1529.3567 1627.0398 1648.6810 1650.6474 1654.0362 1677.3551 1714.1493 3013.7651 3018.1272 3023.6701 3035.3788 3036.8042 3054.5400 3063.0732 3068.9057 3098.1566 3101.1591 3107.0981 3109.2343 3115.9816 3132.0461 3145.8402 3157.4492 3157.8167 3159.3608 3166.5904 3175.0880 3177.0989 3182.0215 3182.5631 3195.4045 3196.2540
redmass: 1.1238 10.8337 5.5051 4.7110 5.5059 8.6766 7.2244 8.5157 11.2737 6.2616 10.2457 4.6622 4.4275 4.6708 6.8483 4.5028 4.0933 5.6931 2.2138 2.1243 6.8759 4.7170 6.0738 6.0792 5.6531 10.9026 6.2759 14.1597 9.2099 1.1102 4.4772 4.0580 2.4961 2.4353 4.0066 6.6940 5.0408 5.0815 4.9730 6.6968 5.0830 4.2841 2.9756 7.5430 3.2724 2.9392 3.1320 4.0370 3.0647 4.4163 4.0780 3.9163 5.0412 4.2389 8.7623 2.9769 15.6053 14.2529 3.7140 7.3114 3.4991 6.2907 4.2756 6.3459 5.5257 4.7188 1.9020 3.9331 1.9594 3.1220 1.7461 6.8910 6.4467 3.6881 2.3205 1.8988 1.8016 2.9470 1.5853 1.8897 1.1708 1.7291 2.8658 1.8549 2.2819 1.5783 1.3871 1.9546 2.2374 1.2586 1.3248 4.9993 2.2699 4.7903 1.7429 1.7186 2.0512 1.9422 2.1303 1.7791 1.9066 3.3773 1.4700 2.2211 1.0758 1.1051 1.4450 3.7122 1.3653 1.1187 1.6926 1.7045 2.1841 4.9368 10.0515 1.7472 4.0586 2.9437 1.3891 1.6053 1.6352 3.4230 1.6609 1.3395 1.5069 1.6098 1.5063 1.4659 1.4225 1.6530 1.2268 3.9170 1.4335 3.4805 1.3382 6.0759 1.0879 1.1477 1.0553 1.1426 1.0521 2.2268 1.0563 1.0796 1.8974 1.2550 2.7561 5.4824 2.6280 6.2083 6.3850 6.5009 6.3910 6.6041 12.3205 1.0833 1.0375 1.0392 1.0820 1.0648 1.0735 1.0478 1.0623 1.1007 1.1021 1.1018 1.1015 1.1023 1.1009 1.1005 1.0878 1.0886 1.0881 1.0884 1.0887 1.1033 1.0919 1.0944 1.0995 1.0981
irintensity: 3578.5694 3.1310 0.6642 2.1933 3.1224 1.6427 3.5577 0.9941 6.0454 0.7764 5.7659 2.1772 0.9098 1.5779 0.7461 2.0439 3.6717 1.1556 0.9924 3.1621 10.9841 1.8747 1.1935 7.0518 0.3801 7.2791 11.3860 8.7288 16.5478 0.8942 5.8407 1.6585 8.4819 4.4360 1.5542 9.5179 15.6798 24.5314 10.8497 0.8349 7.9838 2.0654 2.1318 2.6237 42.4172 0.0718 16.3422 13.1890 11.4092 1.0048 15.0037 33.1717 30.6998 4.3716 8.4328 5.7521 6.7443 60.9052 3.6745 91.4939 2.5308 1.0458 23.7313 24.1156 15.4118 5.8168 26.6616 30.1681 40.7526 14.4760 65.4498 10.7467 27.1407 35.2643 2.9164 23.9032 18.1391 3.8677 38.3762 21.3064 2.9319 21.1729 7.2655 4.6261 35.7802 21.8405 3.4172 1.3624 14.5898 0.1909 1.3871 1.2192 2.4583 102.5654 9.3541 8.1696 5.6555 69.1670 4.2371 44.2183 27.4976 132.2893 12.5142 11.4654 0.4908 40.3463 359.1898 204.2004 82.1174 0.5752 118.9683 10.6585 47.1083 298.2700 409.1744 118.9476 64.6766 109.2059 0.9912 35.9197 25.7714 362.0988 70.0219 21.9415 113.5774 42.3857 8.4500 1.2660 6.1715 32.6694 9.9840 10.5671 10.3352 10.7135 25.9251 401.4814 42.2348 21.4277 12.0528 8.1289 3.3799 2.1767 11.4953 21.0927 5.2019 10.9216 23.5339 9.7132 20.3335 3.0893 229.8656 425.3869 1.4636 15.9314 1130.3001 38.6708 35.9164 18.5431 10.9637 22.1382 16.3471 32.4531 9.3211 32.5357 16.1087 13.6618 87.6998 33.2282 13.8754 3.5712 15.3888 9.6846 7.1007 3.9176 2.2618 14.0330 13.1060 36.7304 32.0249 30.9160
temp: 298.150 k
press: 1.00000 atm
elementType: 16 9 9 9 8 8 7 6 1 6 6 6 1 6 1 6 1 6 6 6 1 6 1 6 1 6 1 6 6 1 1 1 46 6 6 8 8 1 7 6 8 6 6 6 1 1 1 1 1 1 1 55 6 1 1 1 6 1 1 6 1 1
symmnumber: 1
zpe: 1215031.2 jmol-1
zpe.correction: 0.462781 hartree
zpe.thermalcorrener: 0.498814 hartree
zpe.thermalcorrenthalpy: 0.499759 hartree
zpe.thermalcorrgfe: 0.393212 hartree
zpe.sumelectzpe: -2220.704281 hartree
zpe.sumelectthermal: -2220.668247 hartree
zpe.sumelectthermalent: -2220.667303 hartree
zpe.sumelectthermalfe: -2220.773849 hartree
dipole: 4.9942 -4.2999 -1.1288
dipole: 6.6862
quadrupole: -219.2557 -210.9166 -248.5773
quadrupole: -28.4472 6.5084 19.9875
quadrupole: 6.9942 15.3332 -22.3274 -28.4472 6.5084 19.9875
hfenergy: -2221.1670616 hartree
pointgroup: C01 [X(C23H26Cs1F3N2O5Pd1S1)]
dipole: 1.9648817 -1.6916965 -0.4440891 debye
polarizability: 513.100347|2.0640046|372.6234525|-13.7138106|31.5264593|351.5752046 unknown
InChI: InChI=1S/C16H16F3NO2S.C7H11NO3.Cs.Pd/c17-16(18,19)23(21,22)20-15(11-13-7-3-1-4-8-13)12-14-9-5-2-6-10-14;1-4(2)6(7(10)11)8-5(3)9;;/h1-10,15,21H,11-12H2;4,6H,1-3H3;;/q-1;-2;2*+2/p-1
charge 0 multiplicity 1
62 atoms
S  -0.571463 -1.610964 1.089344
F  -0.265992 0.204259 2.986685
F  -2.262325 -0.605917 2.890621
F  -0.660491 -1.78831 3.723062
O  -1.370592 -2.840034 1.037758
O  0.882894 -1.759692 1.22086
N  -0.943088 -0.515962 0.020566
C  -2.250251 -0.420504 -0.682806
H  -2.172126 -1.014443 -1.60721
C  -2.157474 1.981078 0.042103
C  -3.145829 2.38691 0.935364
C  -2.810716 3.129262 2.066823
H  -3.59367 3.431797 2.759305
C  -1.487715 3.490174 2.318934
H  -1.237841 4.070417 3.20392
C  -0.501734 3.120109 1.41515
H  0.530155 3.439243 1.566264
C  -0.82034 2.375566 0.265245
C  -4.72157 -0.952265 -0.765009
C  -5.82267 -0.144473 -0.47242
H  -5.782338 0.512461 0.397121
C  -6.969067 -0.179392 -1.261038
H  -7.815908 0.456949 -1.012374
C  -7.031388 -1.025987 -2.36263
H  -7.924917 -1.054454 -2.982351
C  -5.943593 -1.841987 -2.662981
H  -5.987007 -2.514869 -3.51706
C  -4.802438 -1.806315 -1.869823
C  -0.96875 -0.904936 2.771626
H  -3.961523 -2.460424 -2.101604
H  -4.185094 2.117945 0.747828
H  -0.214841 2.884751 -0.731888
Pd 0.570739 0.909608 -0.441782
C  3.348265 1.572971 -0.981178
C  3.205399 0.080553 -1.288392
O  2.024619 -0.429111 -1.227384
O  4.223185 -0.582723 -1.531848
H  3.996565 1.995991 -1.761448
N  2.032441 2.194122 -1.002042
C  1.704486 3.331182 -1.586834
O  0.500885 3.740848 -1.602401
C  4.078408 1.740846 0.370433
C  3.366631 1.037645 1.519311
C  4.30772 3.208281 0.69506
H  5.055761 1.256841 0.222506
H  3.229802 -0.036495 1.335476
H  3.940685 1.14678 2.447804
H  2.367024 1.460615 1.69569
H  4.871622 3.721228 -0.094492
H  3.353696 3.7365 0.829903
H  4.874025 3.3141 1.628286
Cs 2.976021 -3.285073 -0.452898
C  2.706994 4.239369 -2.243445
H  2.297205 4.56157 -3.204907
H  2.821882 5.135976 -1.624122
H  3.692153 3.797684 -2.402299
C  -2.437238 1.05397 -1.100972
H  -1.744568 1.279418 -1.924414
H  -3.458181 1.177292 -1.483553
C  -3.483401 -0.918124 0.089759
H  -3.65135 -0.273887 0.961971
H  -3.28947 -1.925824 0.470977
