program: Gaussian 09
title: 000033920
version: EM64L-G09RevD.01
frameworkgroup: C1[X(C18H20N2O7)]
method: RPBEPBE
basis: SDD
operation: Freq
keyword: #p
keyword: freq=noraman
keyword: PBEPBE/SDD
title: #p freq=noraman PBEPBE/SDD
converged: YES YES NO NO
title: Mulliken charges:
elementType: O O O O O O O N N C C C C C C C C C C C C C C C C C C H H H H H H H H H H H H H H H H H H H H
charge: -0.216158 -0.199434 -0.213061 -0.253722 -0.258212 -0.239992 -0.234110 -0.198299 -0.203495 -0.023411 -0.378041 0.178781 0.137859 0.408839 0.267397 -0.723754 -0.382431 -0.367075 -0.264731 -0.277006 -0.245508 -0.242959 -0.239110 0.321052 0.327514 -0.747810 -0.747931 0.240283 0.233378 0.235591 0.237763 0.224637 0.275470 0.263404 0.261863 0.283598 0.267246 0.282305 0.232542 0.231401 0.234837 0.256904 0.248183 0.250880 0.248956 0.258304 0.247266
chargesum: 0.00000
title: Mulliken charges with hydrogens summed into heavy atoms:
elementType: O O O O O O O N N C C C C C C C C C C C C C C C C C C
charge: -0.216158 -0.199434 -0.213061 -0.253722 -0.258212 -0.239992 -0.234110 -0.198299 -0.203495 -0.023411 0.095619 0.178781 0.137859 0.408839 0.267397 -0.025763 -0.106961 -0.103671 0.280731 0.272544 -0.012966 -0.011559 -0.004274 0.321052 0.327514 0.008157 0.006595
polarizability: 2.43038799e+02 -6.16424254e+00 2.34425516e+02 -1.71212894e+01 -1.73309443e+00 2.03220754e+02
1716.lowfreq: -8.4893 -0.0004 0.0006 0.0007 1.1502 5.6739 9.9102 19.2977 24.2720
frequency: 9.6416 18.8086 24.2049 25.8870 37.9098 40.8757 43.9634 54.5163 57.3255 70.3344 87.6188 96.4524 111.2653 117.2140 139.5510 165.2281 172.3602 183.8255 187.4431 197.4151 209.6769 222.2953 283.1635 296.8567 309.6869 325.7247 332.0018 342.7181 372.6889 400.1614 400.5810 416.2564 436.5835 447.4493 471.6081 491.8466 519.6193 546.0556 559.4394 563.7175 589.5774 611.8637 613.5742 615.8462 671.1813 684.6188 698.5266 702.5726 716.4714 724.0879 765.6805 776.6372 819.5254 836.2697 846.0915 852.3179 913.7142 919.5088 929.1452 930.3002 941.1056 959.4536 982.1569 987.1837 989.4840 992.5039 1000.8829 1028.7082 1030.7561 1042.4099 1042.7711 1044.1654 1054.6198 1084.9563 1093.0212 1142.5244 1152.3842 1166.3530 1173.6158 1176.3497 1177.9071 1184.4244 1208.4699 1212.2034 1266.8075 1294.1499 1303.7769 1329.7737 1333.4711 1341.3757 1345.5608 1376.9520 1377.3535 1383.4541 1386.1540 1393.8172 1394.0297 1436.0144 1448.7075 1449.8632 1452.1322 1453.0676 1455.0232 1455.8121 1458.9469 1482.1485 1483.7093 1486.0780 1589.6711 1602.9893 1604.3979 1609.3237 1660.3595 1664.5566 1673.6545 2989.3535 3008.0463 3008.5525 3028.5874 3066.8736 3067.5412 3076.7223 3083.4190 3100.3681 3101.6189 3101.6863 3128.1105 3135.4161 3143.9989 3144.2209 3144.3353 3145.2977 3146.7972 3156.8030 3168.7987
redmass: 6.6593 5.5071 5.5365 5.5798 4.2575 3.2213 3.2410 1.4324 3.5008 1.1908 4.1080 3.9799 3.7641 3.2320 6.7995 6.6487 7.8130 3.1017 6.8063 5.0261 1.9918 4.5586 3.4162 3.0718 3.5072 3.4440 2.8886 3.9668 3.0022 4.1735 3.6627 7.5015 4.2992 5.3393 4.0097 6.7395 4.0693 4.2746 3.2877 4.6099 5.9022 4.7746 6.2372 6.6228 5.6250 4.1644 4.0579 2.4475 3.3645 9.7129 1.8356 1.7551 4.8786 5.0033 3.5413 1.2598 4.0192 2.2166 3.7792 3.6299 3.0065 2.1413 1.3856 2.2008 5.7381 2.0411 1.3196 3.5200 2.5944 2.1405 1.7078 1.8681 2.7411 2.2637 1.6584 3.4978 2.9732 2.5408 3.3814 2.0073 1.2325 2.8021 1.2781 2.1979 2.6162 1.2633 1.4176 1.4967 1.5118 2.4678 2.3300 1.2269 5.7023 1.2682 1.2720 1.4509 1.2487 2.2304 1.0883 1.0866 1.0561 1.0579 1.0513 1.0549 1.0978 1.9706 1.0640 1.0426 5.9699 9.5663 6.5485 10.0414 9.6187 9.9188 9.7262 1.0357 1.0382 1.0376 1.0606 1.0559 1.0564 1.1007 1.0980 1.0957 1.0946 1.1031 1.0852 1.0881 1.1025 1.1020 1.1104 1.1106 1.0929 1.0955 1.1013
irintensity: 0.1596 0.0902 0.2366 0.5633 0.1103 3.9370 1.6097 0.0730 0.6057 0.2432 0.1576 1.5413 3.9741 7.2138 0.0990 3.1430 3.6067 2.9519 3.2629 2.0989 1.9049 0.5944 4.2638 1.4634 5.0089 7.2830 8.0636 1.8373 13.2102 6.9961 5.9815 18.4268 19.7915 13.7305 5.3329 30.3338 23.9690 15.2302 6.4911 10.1331 2.5526 6.7023 0.4685 1.1065 7.4508 5.2919 5.9210 40.8707 11.1770 7.2247 41.7829 1.9199 57.7359 36.8986 3.4296 2.3089 8.4220 36.6963 161.4594 116.5257 102.8579 0.7879 0.3923 126.6212 3.0754 143.4710 0.4112 8.3799 14.5795 20.3483 2.6352 30.7007 23.4585 4.3622 6.8253 6.5459 17.2217 45.1138 352.2495 163.1985 78.6223 164.6027 58.9888 169.2496 99.4131 7.5583 7.1700 41.9841 52.9451 124.9260 168.5784 1.0074 0.1767 78.5533 24.7403 102.3605 18.3725 16.5763 36.8570 41.7462 25.3133 27.9516 35.0489 14.7912 66.7137 28.9505 7.3406 17.5024 6.1396 176.8275 94.9492 390.5813 92.5659 121.2091 249.3535 26.4572 1.1335 1.0913 12.5258 5.3832 7.7282 3.2229 34.9597 6.7976 5.1344 20.7831 0.4277 3.9559 10.0043 10.3067 4.2863 7.7101 10.8200 17.8001 18.7261
temp: 298.150 k
press: 1.00000 atm
elementType: 8 8 8 8 8 8 8 7 7 6 6 6 6 6 6 6 6 6 6 6 6 6 6 6 6 6 6 1 1 1 1 1 1 1 1 1 1 1 1 1 1 1 1 1 1 1 1
symmnumber: 1
zpe: 943946.7 jmol-1
zpe.correction: 0.359530 hartree
zpe.thermalcorrener: 0.386854 hartree
zpe.thermalcorrenthalpy: 0.387798 hartree
zpe.thermalcorrgfe: 0.296411 hartree
zpe.sumelectzpe: -1332.039268 hartree
zpe.sumelectthermal: -1332.011944 hartree
zpe.sumelectthermalent: -1332.011000 hartree
zpe.sumelectthermalfe: -1332.102386 hartree
dipole: 2.7017 -1.0354 -0.2204
dipole: 2.9016
quadrupole: -151.5921 -161.9114 -157.7400
quadrupole: 9.0567 -21.4681 -4.2514
quadrupole: 5.4891 -4.8303 -0.6588 9.0567 -21.4681 -4.2514
hfenergy: -1332.3987979 hartree
pointgroup: C01 [X(C18H20N2O7)]
dipole: -0.6245896 -0.9554659 -0.0146737 debye
polarizability: 232.1116997|8.0219511|244.9136611|-15.9642305|-2.8195112|203.6597072 unknown
InChI: InChI=1S/C18H20N2O7/c1-4-18(14-8-6-5-7-9-14)15(23)19(10-26-12(2)21)17(25)20(16(18)24)11-27-13(3)22/h5-9H,4,10-11H2,1-3H3
charge 0 multiplicity 1
47 atoms
O  2.114044 -2.086863 -0.527638
O  -1.817256 -0.253743 -2.456808
O  0.592978 2.13452 0.738484
O  3.466806 1.025968 0.096542
O  -2.47889 2.111578 0.066944
O  4.387216 1.952658 2.032106
O  -2.239929 4.430941 0.260019
N  1.334624 -0.008618 0.16954
N  -0.627673 0.939645 -0.854504
C  -0.202354 -1.528788 -1.124893
C  -0.069637 -2.503148 -2.338751
C  1.184176 -1.243424 -0.518039
C  -0.934185 -0.254742 -1.564864
C  -1.036961 -2.216931 0.011445
C  0.431491 1.081692 0.077822
C  0.767095 -1.954229 -3.512376
C  -0.484386 -3.346725 0.669639
C  -2.336457 -1.777873 0.367801
C  2.550376 0.22152 0.945938
C  -1.492048 2.106882 -1.041566
C  -1.220648 -4.025902 1.662957
C  -3.069421 -2.461978 1.364326
C  -2.517374 -3.586398 2.015744
C  4.324502 1.909475 0.78603
C  -2.716686 3.361954 0.688339
C  5.09863 2.756176 -0.196361
C  -3.599533 3.17431 1.898663
H  -1.094022 -2.735541 -2.678685
H  0.382107 -3.437483 -1.964022
H  0.317157 -1.042158 -3.943071
H  1.804319 -1.733796 -3.203525
H  0.815773 -2.707811 -4.318561
H  0.522758 -3.692219 0.411103
H  -2.796688 -0.916878 -0.126724
H  3.019678 -0.751339 1.149487
H  2.326081 0.781633 1.866553
H  -2.036073 1.976752 -1.98742
H  -0.910069 3.040789 -1.009684
H  -0.780324 -4.896518 2.161178
H  -4.074417 -2.113611 1.626602
H  -3.088834 -4.113589 2.787403
H  4.464574 3.598286 -0.528919
H  5.995458 3.163805 0.292704
H  5.375151 2.170575 -1.087158
H  -4.003733 4.146102 2.216777
H  -3.000454 2.747453 2.723275
H  -4.417742 2.46919 1.680448
