program: Gaussian 09
title: 000033878
version: EM64L-G09RevD.01
frameworkgroup: C1[X(C21H27N3O4)]
method: RPBEPBE
basis: SDD
operation: Freq
keyword: #p
keyword: freq=noraman
keyword: PBEPBE/SDD
title: #p freq=noraman PBEPBE/SDD
converged: YES YES NO NO
title: Mulliken charges:
elementType: O O O O N N N C C C C C C C C C C C C C C C C C C C C C H H H H H H H H H H H H H H H H H H H H H H H H H H H
charge: -0.316809 -0.307143 -0.272193 -0.318066 -0.138390 -0.475213 -0.454491 -0.047978 -0.316776 -0.349290 -0.310490 -0.333621 -0.698409 -0.675806 0.239981 0.298517 0.457452 0.475837 -0.427493 -0.439201 -0.356477 -0.342330 -0.197351 -0.194722 -0.212486 -0.205513 -0.260276 -0.256957 0.251020 0.189194 0.207120 0.197033 0.220880 0.229968 0.243427 0.240053 0.239224 0.230938 0.213583 0.219100 0.224166 0.211130 0.212037 0.393104 0.332132 0.227065 0.224455 0.295117 0.276749 0.221902 0.228989 0.223085 0.227257 0.225584 0.231385
chargesum: 0.00000
title: Mulliken charges with hydrogens summed into heavy atoms:
elementType: O O O O N N N C C C C C C C C C C C C C C C C C C C C C
charge: -0.316809 -0.307143 -0.272193 -0.318066 -0.138390 -0.082109 -0.122359 0.203043 0.079538 0.068623 0.162905 0.145656 -0.034789 -0.028473 0.239981 0.298517 0.457452 0.475837 -0.200428 -0.214746 -0.061360 -0.065581 0.024551 0.034267 0.010599 0.021743 -0.034692 -0.025573
polarizability: 3.74204196e+02 -1.39217414e+00 2.74618542e+02 -1.24109775e+01 1.74361059e+01 1.73860825e+02
1716.lowfreq: -7.3970 -5.5629 -2.4037 -0.0009 -0.0005 0.0002 5.8340 16.9112 20.4167
frequency: 4.2560 16.8461 20.3367 27.0964 35.4503 38.2669 48.2793 61.1482 67.5867 76.0106 86.4107 93.7955 118.2093 133.2989 141.1273 147.0717 171.4179 188.5810 197.6672 213.8187 231.2355 240.0107 252.2306 266.0423 285.7927 294.7120 311.7662 338.7914 343.1249 370.0622 391.2436 406.7967 407.9896 416.8354 439.8377 497.7713 507.0400 513.4949 546.9227 600.5833 607.8222 615.4776 619.5212 645.7410 665.9076 677.3696 694.5287 696.5121 702.1617 709.4785 750.5377 763.6295 766.3666 795.9059 800.3074 814.3525 823.7939 836.2808 839.3530 857.3012 864.2669 893.1533 904.5464 909.5471 911.1371 915.6220 934.5696 970.0984 972.0211 984.3087 985.4022 993.1043 993.6793 1003.4460 1016.6310 1018.0851 1031.8923 1036.0020 1059.4280 1076.9736 1084.4682 1088.2924 1089.8847 1103.9327 1113.0264 1118.1347 1156.8676 1169.7543 1171.2588 1173.6238 1180.4623 1188.1227 1190.2176 1203.5310 1206.8933 1258.2256 1260.2869 1275.5391 1278.2344 1292.6032 1314.2266 1324.0645 1325.3583 1327.8367 1349.9414 1362.1432 1372.8022 1375.6103 1386.0272 1387.3910 1387.9998 1389.7720 1433.3981 1438.9164 1450.8199 1465.9147 1471.1924 1473.7732 1479.9528 1484.1550 1486.2480 1487.4378 1489.0067 1497.0204 1517.8868 1544.4271 1601.7377 1603.4032 1616.3337 1618.9569 1644.7752 1672.4298 2862.6909 2878.7398 2985.7723 2985.9495 2997.7247 3020.3542 3029.3690 3032.2948 3039.3967 3065.7487 3078.4656 3079.9666 3091.6005 3093.1881 3108.3924 3116.4584 3121.7009 3130.9845 3134.1225 3143.3810 3146.7361 3162.9945 3167.5104 3185.6823 3192.7510 3336.6855 3539.3380
redmass: 4.6419 3.9722 5.0801 3.3187 4.0749 4.1629 4.6839 3.2542 3.9986 4.5930 5.0050 3.4608 5.0542 2.1564 5.6464 5.6781 2.8765 3.2666 3.0653 2.5829 2.8199 1.5041 4.5115 4.6484 2.6679 2.8161 2.4418 6.0878 6.6298 4.5360 4.3100 2.9103 2.9246 2.4391 3.6969 2.9166 2.8445 2.9524 4.0039 6.1126 5.7225 6.4024 5.5692 1.4155 5.7350 8.6921 2.0183 2.0415 3.9391 6.1194 2.8126 1.6890 1.6676 1.2346 1.1395 1.7748 4.3193 1.7022 1.3897 1.4760 2.1889 4.9407 2.5702 3.1439 1.4732 1.4874 1.9760 1.3635 1.3620 6.0999 5.8250 1.3061 1.3148 2.7504 3.1625 4.0673 2.4726 2.6355 2.6026 2.0803 1.8670 1.5687 1.5613 2.4671 2.8769 2.1229 3.5722 2.2189 1.0615 1.0573 3.1944 1.1146 1.1390 1.4299 1.6882 2.1284 1.1185 2.1296 1.1616 1.2090 1.2845 1.3932 1.3711 1.3756 1.3089 1.3512 1.3239 1.4172 6.2538 1.7449 2.4900 1.2416 2.2882 2.3643 1.1083 1.0489 1.0471 1.0554 1.0765 1.0612 2.2620 1.0648 2.3686 1.0774 2.2333 2.0535 5.4136 4.1444 5.6513 6.0060 8.1838 6.8283 1.0723 1.0706 1.0357 1.0358 1.0567 1.0860 1.0623 1.0865 1.0824 1.1045 1.0986 1.0981 1.1005 1.1006 1.1091 1.0885 1.0854 1.0881 1.0870 1.0943 1.0935 1.0996 1.0997 1.0954 1.0948 1.0808 1.0759
irintensity: 0.3055 0.1136 0.2062 0.2716 0.2468 0.1216 2.0030 0.5246 3.2482 0.8570 1.5936 0.3842 1.9836 1.3411 8.4752 2.0113 5.8144 1.3805 1.9411 1.1362 4.6450 0.4098 1.3890 4.3752 12.5614 20.2982 2.5808 1.8620 2.7741 0.1216 8.1552 0.0552 0.0225 8.3011 6.9129 14.8713 20.4760 22.1544 22.4424 2.8357 0.8499 1.2887 1.3744 20.6479 7.2077 11.3599 16.1251 34.1247 69.1380 19.8240 9.6905 39.9974 116.8475 14.9594 4.6246 50.3134 5.8449 8.6005 6.6972 34.0506 10.0451 0.5776 2.7991 20.2911 7.7635 30.7040 6.6090 0.1140 0.2267 2.8235 4.5805 1.3405 3.6314 14.5314 96.8867 244.5943 39.9993 128.8106 9.2476 26.4423 1.3908 35.7009 20.5810 19.9834 32.0337 16.6889 144.2817 23.2526 8.7929 5.9563 608.0451 2.4234 53.4750 6.2847 23.3433 3.4543 31.3403 22.4324 1.4126 23.1724 16.7702 51.3235 10.0011 36.7284 12.3650 6.7533 2.5246 15.0365 16.9368 16.9211 59.5775 19.1282 102.5903 59.5062 20.8920 9.5217 13.4310 0.5451 21.2991 2.5667 18.1669 13.3505 55.1547 9.5631 473.2134 532.0773 48.0285 98.1084 65.9176 157.7762 372.4581 174.1802 68.6879 98.1033 42.8665 18.0930 35.9418 27.4251 16.4109 23.1974 16.6504 28.9039 40.6642 77.9051 28.0946 46.5303 11.7094 12.0844 8.0864 3.8077 0.8584 39.9858 25.7999 25.6142 24.1284 5.9080 3.0777 505.3599 31.6501
temp: 298.150 k
press: 1.00000 atm
elementType: 8 8 8 8 7 7 7 6 6 6 6 6 6 6 6 6 6 6 6 6 6 6 6 6 6 6 6 6 1 1 1 1 1 1 1 1 1 1 1 1 1 1 1 1 1 1 1 1 1 1 1 1 1 1 1
symmnumber: 1
zpe: 1183211.6 jmol-1
zpe.correction: 0.450662 hartree
zpe.thermalcorrener: 0.478841 hartree
zpe.thermalcorrenthalpy: 0.479785 hartree
zpe.thermalcorrgfe: 0.386053 hartree
zpe.sumelectzpe: -1279.512365 hartree
zpe.sumelectthermal: -1279.484185 hartree
zpe.sumelectthermalent: -1279.483241 hartree
zpe.sumelectthermalfe: -1279.576973 hartree
dipole: 1.9530 -3.9984 0.1354
dipole: 4.4519
quadrupole: -140.4744 -163.8522 -168.9684
quadrupole: 3.7125 -1.7431 9.3722
quadrupole: 17.2906 -6.0872 -11.2034 3.7125 -1.7431 9.3722
hfenergy: -1279.9630263 hartree
pointgroup: C01 [X(C21H27N3O4)]
dipole: 1.0801088 -1.3125551 0.4224068 debye
polarizability: 280.5027778|46.0302058|349.6209122|28.7188308|-36.8014236|192.5598736 unknown
InChI: InChI=1S/C21H27N3O4/c1-3-24(4-2)19(15-27-20(25)22-17-11-7-5-8-12-17)16-28-21(26)23-18-13-9-6-10-14-18/h5-14,19,22-23H,3-4,15-16H2,1-2H3
charge 0 multiplicity 1
55 atoms
O  -1.522499 -0.532323 0.439672
O  1.135404 -2.115196 0.073289
O  -3.518586 0.69115 0.163099
O  1.063602 0.014254 -0.962714
N  -1.758402 -4.280316 0.184083
N  -1.369872 1.544919 -0.415818
N  2.656607 -0.583734 0.679997
C  -1.182504 -2.928128 0.411371
C  -2.479482 -4.864844 1.347533
C  -2.505455 -4.437473 -1.097246
C  -2.25818 -1.809432 0.473826
C  -0.075416 -2.613485 -0.634162
C  -1.599218 -5.046625 2.598031
C  -2.404979 -5.865336 -1.671073
C  -2.268029 0.615156 0.061821
C  1.570051 -0.802923 -0.145832
C  -1.637546 2.888013 -0.79076
C  3.473037 0.578551 0.77787
C  -0.543053 3.657984 -1.270875
C  4.464465 0.58946 1.795533
C  -2.928065 3.47619 -0.704311
C  3.343737 1.692828 -0.091964
C  -0.735483 4.998527 -1.659622
C  5.314791 1.703188 1.945174
C  -3.101978 4.821484 -1.094988
C  4.201959 2.801302 0.073154
C  -2.017223 5.591677 -1.57383
C  5.188125 2.81927 1.085566
H  -0.657848 -2.956086 1.382632
H  -3.394247 -4.278248 1.615933
H  -2.836323 -5.861338 1.029918
H  -3.582557 -4.159358 -0.988574
H  -2.076548 -3.734282 -1.83588
H  -2.859448 -1.869202 1.398518
H  -2.945535 -1.852797 -0.392026
H  0.245263 -3.552982 -1.112768
H  -0.372562 -1.860488 -1.38395
H  -0.672973 -5.588415 2.337266
H  -1.320684 -4.085593 3.066517
H  -2.146472 -5.632583 3.358809
H  -1.347547 -6.142566 -1.824493
H  -2.858103 -6.614297 -0.997243
H  -2.933676 -5.92742 -2.640461
H  -0.416845 1.174403 -0.571472
H  2.888303 -1.369343 1.292367
H  0.451969 3.201214 -1.335558
H  4.565553 -0.270533 2.469843
H  -3.769764 2.879653 -0.345681
H  2.588592 1.67759 -0.879873
H  0.116686 5.580374 -2.028694
H  6.073899 1.698982 2.734941
H  -4.100109 5.269111 -1.026016
H  4.097468 3.658687 -0.601179
H  -2.166704 6.633805 -1.875701
H  5.846802 3.685871 1.203201
