program: Gaussian 16
title: Title Card Required
version: ES64L-G16RevC.01
method: UPBE1PBE
basis: def2SVP
operation: Freq
keyword: #N
keyword: Geom=AllCheck
keyword: Guess=TCheck
keyword: SCRF=Check
keyword: GenChk
keyword: UPBE1PBE/def2SVP
keyword: Freq
converged: YES YES NO YES
elementType: C
elementType: H
elementType: O
elementType: Co
elementType: N
1716.lowfreq: -19.9915 -0.0037 -0.0024 -0.0019 5.2943 10.4192 32.9627 46.2904 49.3199
frequency: 32.9438 46.1287 49.2253 55.7995 62.8624 75.2832 82.6317 86.8717 94.7151 95.6131 107.2362 111.0430 122.3751 127.1968 134.9301 138.3360 145.1187 150.5803 160.1444 161.3420 169.0663 174.3708 178.7934 187.9314 191.3938 201.6950 210.9132 221.9220 237.1338 246.1127 267.8787 275.9475 290.0998 295.2074 302.6321 305.0208 317.4921 329.2465 358.7785 366.3504 379.0511 381.3546 393.1055 419.6120 439.0431 447.3108 463.0405 470.0198 528.7302 531.4086 540.3861 548.5020 566.0490 571.5693 588.3002 604.2665 610.3467 626.1318 629.6670 634.5361 638.0911 656.7590 698.0401 729.7868 751.9790 764.4484 784.7069 789.5901 803.2237 824.3812 827.7349 838.7279 858.3194 886.7029 906.7737 934.3307 944.7027 961.1389 966.8094 977.4664 1001.1918 1016.7819 1018.3197 1020.5594 1024.6863 1025.2620 1033.9853 1035.9600 1038.4924 1039.2820 1039.8803 1052.9389 1061.8405 1084.3967 1087.1328 1111.0334 1112.6972 1127.9472 1141.9048 1157.6222 1167.8529 1170.7243 1193.4783 1208.3300 1221.7667 1242.1450 1254.7247 1270.9330 1310.4056 1321.7542 1344.8937 1358.7079 1360.9459 1364.4555 1366.8645 1372.8065 1380.1256 1384.0955 1386.9100 1389.3876 1397.4666 1400.0087 1414.3892 1418.0221 1422.9449 1423.3490 1425.6502 1428.1708 1429.0441 1429.5568 1432.8739 1433.2721 1437.2064 1440.6020 1442.8984 1446.0852 1446.7315 1457.6249 1462.5180 1464.4393 1475.8322 1479.1493 1481.5541 1524.3400 1533.6531 1587.3302 1621.7598 1690.0056 1700.9040 1741.2752 1749.0445 1832.1026 3048.3062 3049.8445 3050.2630 3051.4739 3052.8172 3053.5985 3061.5301 3070.3186 3076.7228 3103.4660 3132.7020 3132.9727 3138.2644 3138.9838 3140.0846 3141.3962 3156.0085 3165.9964 3169.6060 3173.5359 3173.7776 3174.2754 3177.3603 3181.5406 3182.7140 3183.9892 3195.0918 3197.4968 3200.6314 3229.0204 3239.7926
redmass: 4.0365 4.1417 3.4741 3.8088 3.4881 4.4079 3.0650 1.3950 2.3902 2.5354 1.8987 2.3309 2.1972 3.0999 1.2684 2.3644 2.9590 3.5591 1.2123 1.3804 2.3761 2.5997 2.4244 1.1988 3.6811 4.3464 5.2015 1.6016 4.4364 3.2216 3.9838 2.4281 2.2102 2.6573 2.9838 3.6466 3.6864 2.0749 4.7524 7.1606 4.4607 3.9657 5.4343 4.1000 5.7497 6.3439 6.1680 5.0070 2.3719 4.2567 4.2099 4.2946 2.3491 3.9981 5.4797 3.5664 3.8705 3.9233 4.4522 4.7175 3.9007 4.4177 3.9740 3.7269 5.0449 2.5883 2.4348 1.6788 4.3491 2.2459 3.6724 2.2054 2.1317 1.5784 2.6825 1.7904 1.5127 1.4420 2.2938 2.6618 2.1519 1.4210 1.4289 1.6567 1.6364 1.5362 1.3895 1.9600 1.5566 1.5628 2.1755 1.9800 1.6061 1.8875 1.9287 2.2227 1.7859 2.7229 2.9325 1.2651 2.8013 3.3357 3.2576 1.7079 1.9568 2.0990 1.8487 1.9169 3.0018 2.4334 1.4207 2.0900 1.3708 1.4102 1.2655 1.2474 1.2367 1.2635 1.8274 1.4299 1.5045 1.4502 1.3173 1.2164 1.0764 1.1472 1.3915 1.0580 1.1315 1.1178 1.0566 1.0410 1.1143 1.0662 1.1021 1.0413 1.1018 1.3964 1.0945 2.7082 2.7909 2.6446 4.9175 5.3195 6.5832 7.5450 7.7589 10.9144 10.2736 7.8849 12.0391 12.2463 1.0447 1.0423 1.0427 1.0391 1.0433 1.0446 1.0370 1.0375 1.0850 1.0621 1.0978 1.1028 1.0984 1.0984 1.0973 1.0968 1.1060 1.1046 1.1027 1.1045 1.1050 1.1075 1.1041 1.1061 1.1005 1.0942 1.1013 1.1014 1.0905 1.0978 1.0929
irintensity: 0.2965 5.9017 1.1396 0.5994 3.5905 7.1422 2.4273 2.5193 9.9474 4.2034 1.4476 2.6599 1.0737 10.1071 0.4352 4.7995 4.0967 13.1222 0.7190 2.6792 10.0222 3.4176 0.4074 0.6483 8.3668 2.9372 5.9747 4.2978 3.0683 0.7839 2.1295 0.8378 1.3447 2.2748 0.1487 8.7960 5.1381 4.3061 13.7939 25.6969 28.6391 16.5812 21.5026 4.8368 83.6087 0.9140 13.1696 30.5985 33.1206 3.2854 22.6326 8.2520 0.0840 11.2798 14.8003 6.8080 2.2451 6.9390 18.0061 13.5552 0.9937 8.4677 24.2554 27.8583 30.7257 14.2273 13.5785 42.8988 19.5072 10.1660 70.1888 2.7996 43.8457 16.1556 78.2344 43.2202 10.5162 22.1884 86.3268 58.5145 14.6425 59.3436 84.5421 45.7499 35.7368 15.6467 4.0590 25.7553 1.1732 2.0916 9.7043 27.6229 5.2257 29.3358 20.6319 31.4691 1.5850 164.0673 22.2282 26.2561 251.9792 14.2121 36.0744 21.0311 37.0005 18.1747 216.7671 30.2733 73.5143 69.9021 59.2081 1.0988 54.4955 5.6330 7.5417 14.5774 7.7856 3.2267 304.3893 18.8754 476.5671 16.3455 7.3857 27.8346 5.8833 10.2862 201.3442 10.0478 21.3324 10.3703 0.8150 14.0363 13.6293 18.2713 63.9749 7.8813 57.6091 210.8471 7.4878 96.6191 180.7227 58.1133 293.6537 74.4751 16.5112 19.4898 262.1406 780.2594 622.1089 146.1075 1423.7522 451.0787 46.3413 17.6760 26.0647 28.7557 39.3695 21.0128 20.6350 2.7617 8.5692 20.5698 13.6876 9.4647 3.8618 5.9253 10.5716 3.7283 4.3685 20.0909 2.0417 8.7216 3.8968 14.4981 11.1049 11.3770 2.7000 2.7897 1.7137 6.7996 6.2638 0.9783 2.9693
temp: 298.150 k
press: 1.00000 atm
elementType: 6 6 6 6 6 6 1 1 1 8 27 6 6 6 6 6 6 1 1 1 6 1 1 1 6 1 1 1 6 1 1 1 6 1 1 1 7 6 8 6 1 1 1 6 6 1 1 6 6 8 8 7 6 1 1 6 1 1 1 6 1 1 1
symmnumber: 1
zpe: 1355973.8 jmol-1
zpe.correction: 0.516463 hartree
zpe.thermalcorrener: 0.550500 hartree
zpe.thermalcorrenthalpy: 0.551444 hartree
zpe.thermalcorrgfe: 0.452212 hartree
zpe.sumelectzpe: -2761.206428 hartree
zpe.sumelectthermal: -2761.172391 hartree
zpe.sumelectthermalent: -2761.171447 hartree
zpe.sumelectthermalfe: -2761.270679 hartree
dipole: 2.3707 -3.1349 -5.2232
dipole: 6.5368
quadrupole: -167.4624 -192.7909 -202.8810
quadrupole: -8.5753 -10.4219 12.0545
quadrupole: 20.2491 -5.0795 -15.1696 -8.5753 -10.4219 12.0545
hfenergy: -2761.7228909 hartree
pointgroup: C01 [X(C25H31Co1N2O4)]
dipole: 0.7711515 -2.2838981 -0.89619 debye
polarizability: 575.7474936|-0.5728592|444.5767918|-5.4254959|-19.0945207|432.7843895 unknown
InChI: InChI=1S/C15H16N2O4.C10H15.Co/c1-4-17-13(20)7-11(14(17)21)15(16-10(3)18)8-9(2)5-6-12(15)19;1-6-7(2)9(4)10(5)8(6)3;/h5-8,11H,4H2,1-3H3;1-5H3;/q-1;;+1
charge 0 multiplicity 3
63 atoms
C  4.09361848 -1.31201557 0.44146992
C  3.15134697 -0.38167648 0.7122702
C  1.72400064 -0.54794643 0.30197245
C  1.34288759 -1.97367178 -0.07745905
C  2.38961479 -2.9118713 -0.38767809
C  3.68394537 -2.57699361 -0.14291366
H  3.42233913 0.56948708 1.17259576
H  2.10531199 -3.89733028 -0.7637131
H  4.46818663 -3.31039461 -0.35823758
O  0.13945513 -2.23439591 -0.16077287
Co -0.97151953 -0.21126485 0.18653496
C  -2.57924144 -1.06816604 1.45248636
C  -2.75863384 0.36973187 1.37059714
C  -2.74305623 -1.61473924 0.1524235
C  -2.9457789 0.70560958 0.01836377
C  -2.89406739 -0.52645961 -0.75439677
C  -3.15569744 -0.64021282 -2.21395626
H  -4.24466767 -0.6694089 -2.39453909
H  -2.74717187 0.21626384 -2.7661931
H  -2.72922971 -1.56309018 -2.63151663
C  -2.71441021 -3.05642685 -0.21949354
H  -2.18454221 -3.65995613 0.52981131
H  -3.74067531 -3.45428553 -0.3011973
H  -2.22166024 -3.21695008 -1.18880286
C  -2.36371949 -1.83906527 2.70613858
H  -1.84555415 -2.78853769 2.5096554
H  -1.769739 -1.26430569 3.42996667
H  -3.33022081 -2.07996963 3.18187013
C  -2.87613083 1.32123959 2.51200832
H  -3.92690973 1.6407037 2.62212331
H  -2.55915547 0.86874747 3.45862928
H  -2.27559708 2.22934962 2.35434684
C  -3.28472773 2.06235214 -0.49253462
H  -4.36456813 2.2540352 -0.36341254
H  -2.74777578 2.84662808 0.06196818
H  -3.04815727 2.17444793 -1.55708535
N  0.70277182 0.0096355 1.17564408
C  0.76203793 -0.17399729 2.51861929
O  -0.03615619 0.39463275 3.27160672
C  1.79790212 -1.08706929 3.13729897
H  2.02852438 -1.97011772 2.52463318
H  2.73610087 -0.54113813 3.31738173
H  1.41110563 -1.41316951 4.11225677
C  0.0748109 0.18506291 -1.51923792
C  1.52098044 0.21944318 -1.0530299
H  -0.20308499 -0.59322476 -2.23820196
H  2.22053131 -0.17815871 -1.80963433
C  -0.20204622 1.54142144 -1.99685362
C  1.81717507 1.7070567 -0.91043858
O  2.80585625 2.2348065 -0.4398043
O  -1.08694995 1.95534008 -2.72986154
N  0.77480308 2.39286267 -1.47166297
C  0.76325408 3.83078145 -1.6445413
H  -0.28806259 4.1514203 -1.61725541
H  1.27214402 4.26307247 -0.77077708
C  1.4311427 4.26996376 -2.93337054
H  0.91568468 3.84324311 -3.80712143
H  2.48513063 3.95297859 -2.95771411
H  1.4014723 5.36675809 -3.01873148
C  5.54361034 -1.11563788 0.75677583
H  6.15702356 -1.18856026 -0.15651383
H  5.72445316 -0.13396927 1.21601145
H  5.90577241 -1.89530028 1.44712263
