program: Gaussian 16
title: Title Card Required
version: ES64L-G16RevC.01
method: UPBE1PBE
basis: def2SVP
operation: Freq
keyword: #N
keyword: Geom=AllCheck
keyword: Guess=TCheck
keyword: SCRF=Check
keyword: GenChk
keyword: UPBE1PBE/def2SVP
keyword: Freq
converged: YES YES YES YES
elementType: C
elementType: H
elementType: O
elementType: Co
elementType: N
1716.lowfreq: -261.1668 -0.0053 -0.0040 0.0024 5.6330 10.2760 11.8922 42.5407 48.7887
frequency: -261.1667 42.5260 48.7811 53.2961 61.7961 64.2935 77.0293 79.2244 88.8310 100.3969 104.6508 113.0496 119.3778 121.9004 131.0734 134.8453 140.3264 148.6029 151.5583 156.6957 163.7006 169.3294 179.5080 190.7821 193.8366 214.3810 215.7243 230.0568 235.7253 258.5040 274.4824 278.0045 295.1528 304.2774 309.3671 314.2405 322.6008 332.0384 335.8135 346.9180 370.7025 390.2173 415.8747 434.5552 439.4064 444.9586 470.4546 474.5316 495.2100 514.0717 539.1738 545.3980 550.0669 561.0118 567.5192 585.7258 591.3245 613.8332 614.6600 632.8758 636.0405 641.7401 662.3294 704.7626 730.0697 737.7272 754.8530 785.3468 788.9219 825.6650 831.2505 834.9400 835.5834 848.1150 913.0760 931.9675 937.0135 963.5178 966.7652 972.9889 982.1993 1001.6162 1005.6997 1008.1348 1020.0441 1023.3905 1025.5301 1025.8995 1027.9376 1038.4341 1039.4376 1042.2361 1063.0237 1091.7628 1093.1827 1111.5699 1114.6853 1123.7460 1140.7703 1152.1698 1166.4814 1196.7189 1199.3397 1212.3543 1238.1961 1244.9817 1258.6257 1284.2489 1330.7405 1341.7574 1365.6309 1368.1274 1369.5837 1370.1835 1374.0260 1378.0638 1379.3048 1382.8128 1392.8442 1395.6215 1400.1088 1405.3621 1417.7210 1419.3025 1420.1135 1422.2715 1423.9664 1425.3358 1427.6695 1428.7407 1432.7977 1439.0138 1442.6967 1446.4619 1446.6884 1452.6868 1457.5129 1462.3454 1467.8744 1488.0872 1492.3896 1495.8861 1502.6390 1524.0459 1541.4309 1548.0316 1559.8323 1575.0978 1578.3558 1668.6255 1744.9671 1826.4527 3032.6405 3050.0467 3057.4095 3058.1700 3059.3066 3060.5468 3060.8596 3061.0862 3064.2087 3103.2416 3129.7383 3145.3886 3149.7387 3150.8487 3151.0167 3155.2555 3156.4274 3158.2899 3162.0409 3165.3760 3173.7569 3177.7639 3178.8059 3183.0485 3192.9621 3198.2820 3202.2599 3205.0826 3210.6667 3232.9045 3242.5695
redmass: 8.6160 2.6872 3.8366 4.2299 3.1102 3.5300 1.4810 2.6827 1.2722 2.2878 2.2399 1.6494 1.9949 2.3939 1.2873 1.2948 3.9792 1.3785 2.7219 1.6600 2.7891 3.2782 4.0273 2.5290 4.0469 2.6816 3.0664 1.6768 4.4538 4.7456 3.7362 4.0539 3.4722 2.4249 2.5086 4.5186 3.2409 2.5978 4.3804 4.5790 7.1879 4.2045 4.5295 4.2319 4.6026 4.2227 5.2510 5.4857 6.1971 3.5788 2.6068 4.1868 4.1301 5.4405 2.4140 3.0711 5.9872 4.2901 4.5168 4.3968 6.4112 3.7440 7.2906 4.2116 3.8134 3.3946 3.2245 1.9522 2.5937 3.9246 2.1730 2.1825 1.8477 3.8189 1.3580 2.9167 3.7909 1.4161 1.4223 1.8648 1.5830 1.5745 1.6221 1.3136 1.4381 1.8524 1.8005 1.5092 1.4568 1.5492 1.5995 1.6324 1.8679 1.8914 1.8999 2.2242 1.7803 2.2114 1.6099 1.2709 2.7048 3.2560 3.3315 1.6982 1.5634 2.3217 1.6994 1.7975 2.5062 1.2819 1.2608 1.3076 2.0258 1.6453 1.2682 1.4153 1.2904 1.2464 1.5643 1.7523 1.5068 1.9650 1.1717 1.1058 1.1140 1.1767 1.0455 1.0539 1.0465 1.1092 1.0638 1.0762 1.5587 1.0417 1.0734 1.0797 1.1058 1.0895 3.3217 6.8476 5.0633 4.4953 3.6707 5.6049 6.7269 6.8906 6.4739 7.3599 6.9364 6.3926 12.0927 12.0810 1.0822 1.0396 1.0435 1.0415 1.0450 1.0418 1.0371 1.0439 1.0367 1.0625 1.1014 1.0991 1.0987 1.0975 1.0972 1.1054 1.0953 1.0890 1.1030 1.1045 1.1072 1.1046 1.1043 1.1047 1.1062 1.1038 1.1039 1.1026 1.0904 1.0982 1.0929
irintensity: 28.2403 0.3362 0.3508 3.0241 5.3815 0.8574 1.2162 1.8409 0.7236 1.6723 6.1130 6.8951 2.6706 2.8688 1.4919 1.6551 6.2334 1.1548 4.4427 2.3554 12.6254 1.0695 11.5303 0.7018 21.8707 5.1545 5.1532 7.3868 7.0547 14.9877 14.4673 10.1520 2.2572 2.1268 0.4409 1.3727 3.6282 7.9705 28.9017 14.9482 24.1781 1.5191 38.2432 19.4590 12.6141 6.9153 29.5523 24.4404 31.0508 60.8831 7.1376 0.4001 1.1534 26.2156 0.0767 67.9732 16.0072 12.0533 20.1506 24.6693 7.3675 14.2498 24.8594 5.1056 25.5147 12.1837 11.5873 32.0770 34.4229 35.9611 1.8953 0.5903 32.6613 4.2800 31.1208 79.7699 90.4515 3.7387 3.4965 1.9492 109.8514 72.8909 40.3543 2.8792 108.9633 13.4502 21.5704 46.9861 59.2812 1.0340 5.0569 17.0377 23.1415 23.8024 42.3076 15.3123 1.6525 46.9139 22.4146 57.4406 131.5955 3.7651 0.9941 27.6399 4.1900 23.6245 127.4788 99.8506 13.3878 20.3676 3.3985 12.0466 87.0619 30.8411 46.9031 42.5403 10.2794 22.5593 300.9394 182.1363 47.8758 40.3508 0.5611 39.0019 21.8369 1.2641 5.5499 8.3946 10.8781 23.9879 4.1076 5.7825 44.2955 10.2770 41.8010 5.2525 132.5240 11.2099 388.7000 432.2852 204.3369 15.7958 16.2483 58.0984 330.1160 488.5898 147.1032 684.3122 245.2964 253.1506 1617.6609 348.7480 6.0221 7.1554 27.5199 26.4470 34.9656 21.9210 23.6489 17.9949 3.8751 17.1338 6.0630 2.6967 1.5994 6.6108 8.6919 5.4523 0.7889 8.9449 2.3102 20.8244 14.5345 14.4611 7.0908 6.0800 9.0171 8.3508 1.1100 2.3094 5.8842 4.2406 18.2944
temp: 298.150 k
press: 1.00000 atm
elementType: 6 6 6 6 6 6 1 1 1 8 27 6 6 6 6 6 6 1 1 1 6 1 1 1 6 1 1 1 6 1 1 1 6 1 1 1 7 6 8 6 1 1 1 6 6 1 1 6 6 8 8 7 6 1 1 6 1 1 1 6 1 1 1
symmnumber: 1
zpe: 1352691.2 jmol-1
zpe.correction: 0.515213 hartree
zpe.thermalcorrener: 0.548598 hartree
zpe.thermalcorrenthalpy: 0.549542 hartree
zpe.thermalcorrgfe: 0.453327 hartree
zpe.sumelectzpe: -2761.148015 hartree
zpe.sumelectthermal: -2761.114630 hartree
zpe.sumelectthermalent: -2761.113686 hartree
zpe.sumelectthermalfe: -2761.209900 hartree
dipole: 1.0809 -9.6305 -2.8518
dipole: 10.1019
quadrupole: -168.5639 -186.9496 -196.6133
quadrupole: -4.2707 -4.7332 -4.3200
quadrupole: 15.4784 -2.9073 -12.5710 -4.2707 -4.7332 -4.3200
hfenergy: -2761.6632276 hartree
pointgroup: C01 [X(C25H31Co1N2O4)]
dipole: 0.4491096 -3.8044663 -1.0582937 debye
polarizability: 740.9183613|-50.6250416|521.9087872|-22.562824|47.3402572|424.0263516 unknown
InChI: InChI=1S/C13H13NO3.C10H15.C2H3NO.Co/c1-3-14-12(16)7-10(13(14)17)9-6-8(2)4-5-11(9)15;1-6-7(2)9(4)10(5)8(6)3;1-2(3)4;/h4-7,10H,3H2,1-2H3;1-5H3;1H3;/q-1;;;+1
charge 0 multiplicity 1
63 atoms
C  4.16400219 -1.43283622 -0.24809565
C  3.35483817 -0.31814557 -0.35251433
C  1.98110189 -0.40653605 -0.685592
C  1.43100759 -1.7351075 -0.90963345
C  2.30389828 -2.87018359 -0.89380941
C  3.61378501 -2.72335295 -0.5412527
H  3.78573389 0.67249166 -0.20878446
H  1.86258368 -3.84801338 -1.09882678
H  4.26185286 -3.60172858 -0.47303018
O  0.18155227 -1.91388989 -1.04411217
Co -0.94735997 -0.64052889 -0.17812483
C  -2.254487 -1.01326137 1.4412698
C  -2.73524787 0.05818845 0.61216316
C  -2.12826938 -2.17590037 0.6385862
C  -2.98789014 -0.48646234 -0.70021433
C  -2.5887109 -1.84702606 -0.68727413
C  -2.63538549 -2.795323 -1.83070257
H  -3.5512492 -3.40752039 -1.77441582
H  -2.64217941 -2.27090993 -2.79572712
H  -1.77771224 -3.48205134 -1.81592361
C  -1.63219461 -3.50856929 1.07318595
H  -1.01793575 -3.43403668 1.98096651
H  -2.47738837 -4.18203793 1.29433686
H  -1.02851421 -3.98631625 0.28813422
C  -1.96843137 -0.93223074 2.89716359
H  -1.13902296 -1.59295458 3.1851969
H  -1.7186161 0.08846319 3.20774214
H  -2.86130578 -1.25664585 3.45846382
C  -3.11430772 1.41220186 1.10018137
H  -4.0653714 1.35451166 1.6566236
H  -2.35025607 1.81546399 1.7783261
H  -3.24747584 2.11721009 0.27138476
C  -3.64211094 0.21146336 -1.83765999
H  -4.73737093 0.1568006 -1.71511117
H  -3.35126435 1.26735595 -1.88371994
H  -3.39392067 -0.2609441 -2.79810048
N  0.44770169 -0.15005704 0.93194615
C  0.7989719 0.54152331 1.99727879
O  0.09238063 1.47025326 2.45760388
C  2.11534147 0.20424867 2.64829003
H  2.53128047 -0.75156976 2.30615622
H  2.83416176 1.01067969 2.43396715
H  1.95751077 0.17269113 3.73703385
C  -0.23535681 0.72144877 -1.4718933
C  1.27983024 0.79060642 -1.28863394
H  -0.58062528 0.36868445 -2.45188463
H  1.76481248 0.989984 -2.26524719
C  -0.69887053 2.08712178 -1.1768624
C  1.48285513 2.06077848 -0.46881809
O  2.49759484 2.46144695 0.07226378
O  -1.74021181 2.65279843 -1.47337847
N  0.30383945 2.74562158 -0.46901691
C  0.13336562 4.03375111 0.16880536
H  -0.92943097 4.11913501 0.4354691
H  0.71247048 4.00621283 1.10352654
C  0.56567045 5.18835471 -0.71358661
H  -0.02562389 5.21391892 -1.64171222
H  1.63090313 5.10449235 -0.9782781
H  0.41852018 6.14279462 -0.18580093
C  5.60514067 -1.32295051 0.12273563
H  6.24787409 -1.77720938 -0.64932713
H  5.90994406 -0.27744625 0.26553677
H  5.80331061 -1.87375852 1.05808779
