program: Gaussian 16
title: Title Card Required
version: ES64L-G16RevC.01
method: RPBE1PBE
basis: def2SVP
operation: Freq
keyword: #N
keyword: Geom=AllCheck
keyword: Guess=TCheck
keyword: SCRF=Check
keyword: GenChk
keyword: RPBE1PBE/def2SVP
keyword: Freq
converged: YES YES NO YES
title: Mulliken charges:
elementType: C C C H C C H C H H O N Co O C O C H H H C C C C C C O C H H H C H H H C H H H C H H H C H H H C H H H C H H H
charge: -0.030350 -0.134015 -0.172448 0.096528 -0.031101 0.285993 0.043782 -0.078929 0.045095 0.045265 -0.276190 -0.187960 0.132377 -0.425653 0.214895 -0.437213 -0.058729 0.069415 0.054676 0.076233 -0.078485 -0.115146 -0.185439 -0.030485 -0.178773 0.124872 -0.455756 -0.047632 0.074548 0.052914 0.073128 0.011353 0.065860 0.052317 0.066387 0.060075 0.077411 0.078644 0.063595 0.064291 0.073588 0.066722 0.059696 0.061002 0.055146 0.064553 0.071412 0.057840 0.066222 0.070419 0.076480 0.068531 0.063650 0.064226 0.075167
chargesum: -0.00000
title: Mulliken charges with hydrogens summed into heavy atoms:
elementType: C C C C C C O N Co O C O C C C C C C C O C C C C C C C
charge: 0.014915 -0.134015 -0.075921 0.012681 0.285993 -0.033834 -0.276190 -0.187960 0.132377 -0.425653 0.214895 -0.437213 0.141594 -0.078485 -0.115146 -0.185439 -0.030485 -0.178773 0.124872 -0.455756 0.152958 0.195917 0.279724 0.264296 0.252113 0.270961 0.271573
1716.lowfreq: -8.4268 -0.0066 -0.0057 -0.0053 6.8847 15.6463 24.9158 35.0765 40.1493
frequency: 21.6977 35.0057 40.1120 50.2952 55.0359 63.3650 72.0670 82.9862 89.7979 108.0091 117.2335 118.1080 126.2715 131.1782 143.7304 151.9297 157.3726 162.2498 168.5776 172.8075 185.0515 186.8459 190.8778 196.8723 209.8704 218.5561 244.3035 262.8383 292.4693 298.9121 300.8371 303.5404 313.4517 334.0833 347.4422 354.3674 361.4876 402.5068 442.2028 445.7163 450.4798 474.1584 519.4801 530.4413 537.2627 549.8330 550.7239 567.2755 581.6263 602.6184 607.2369 614.0324 628.4052 637.4328 638.9844 670.2870 691.4566 726.6395 767.4367 827.0164 837.1249 845.2207 858.0281 891.9378 933.4928 945.3091 960.3052 967.5026 970.7687 996.4580 1000.2148 1016.0576 1021.6020 1022.8857 1023.6798 1024.9609 1028.4993 1033.4249 1035.3745 1035.9909 1040.6090 1052.0283 1072.3033 1090.4340 1093.9101 1113.2787 1132.6259 1186.9639 1199.9678 1201.0659 1252.3910 1297.2067 1305.4374 1333.5782 1347.4890 1365.2474 1372.0986 1377.1289 1378.0117 1381.6163 1385.4796 1392.7324 1411.7978 1412.4293 1415.4610 1416.3654 1417.9778 1418.7623 1424.7777 1425.7597 1429.2347 1429.9047 1433.0627 1435.8303 1439.7123 1441.3629 1442.8680 1447.1363 1450.4451 1463.6024 1490.8047 1502.2952 1524.5384 1528.3090 1546.4702 1551.1279 1588.7380 1654.0705 1674.4505 1691.8887 1702.2738 2936.8563 3052.4121 3060.6984 3061.9967 3062.9951 3064.2109 3064.5257 3068.0869 3069.5969 3134.5265 3151.7446 3152.1784 3154.7672 3156.0243 3157.1392 3164.5393 3165.9428 3166.9652 3190.5207 3192.2469 3193.0784 3195.9478 3197.3808 3198.1970 3198.8566 3203.1831 3211.3145 3229.2551
redmass: 3.7958 1.3318 3.1904 2.8329 3.2206 3.8532 2.0854 3.1413 2.0775 2.0017 3.0431 1.3671 1.3139 2.1564 2.0364 1.2186 4.4922 1.2947 3.3180 3.0276 2.4209 2.1020 2.4327 3.3043 1.6299 4.5352 3.3643 4.7364 3.2831 3.3645 2.4223 2.6914 2.3077 4.0817 6.0069 4.5470 5.8497 3.6559 3.5185 3.8836 4.3312 4.5314 3.5668 3.4613 3.7619 4.1814 4.1143 2.4481 2.7775 3.8482 2.5541 3.8331 6.1506 3.8134 3.5965 6.6067 6.0595 2.8439 3.4362 2.1643 2.1686 1.5113 1.5533 4.4632 3.5820 1.3658 1.4200 1.3999 4.6763 1.3814 1.3684 1.4562 1.4979 1.5074 1.7416 1.8409 1.8048 1.7700 1.6767 1.6678 1.9361 1.5752 7.4065 1.9105 1.9101 1.7919 1.1873 1.1097 3.2906 3.2344 2.1241 2.9817 1.5818 1.3675 1.3046 1.2840 1.4027 1.2447 1.2300 1.2641 1.6011 2.6758 1.0903 1.1250 1.0864 1.0960 1.1590 1.1160 1.2993 1.0907 1.0471 1.0804 1.0723 1.0538 1.5031 1.0841 1.0751 1.7582 1.4102 2.3275 4.1733 3.7075 6.9193 6.1450 3.8553 6.2122 7.2050 7.3335 9.3332 7.2806 10.7421 1.0936 1.0392 1.0430 1.0430 1.0427 1.0419 1.0415 1.0372 1.0374 1.1029 1.0974 1.0974 1.0977 1.0984 1.0979 1.1029 1.1044 1.1019 1.1051 1.1054 1.1054 1.1044 1.1083 1.1040 1.1069 1.0911 1.0932 1.0965
irintensity: 0.7141 1.0018 1.7426 4.4692 8.4363 6.4045 1.1693 8.3072 5.4504 0.9003 2.8699 0.2456 0.1388 11.0861 15.4283 1.5697 2.5956 6.6666 9.1952 19.9768 11.5773 9.6969 1.4337 6.7383 3.7854 4.6923 4.7149 3.8211 9.5842 4.7311 0.2615 0.6653 0.3621 3.4281 6.8149 10.0461 9.1714 9.0329 3.0245 8.6863 20.6765 40.8309 15.3397 21.4661 2.9536 0.5287 2.5383 0.2635 12.9338 4.5925 14.2556 8.2240 11.5872 0.9575 1.1091 25.8749 53.0800 14.7910 64.5212 1.2562 1.4322 71.9794 131.7815 19.8773 9.7989 42.8466 0.4130 2.3940 7.0910 8.1531 27.5754 58.9804 47.1292 59.6734 6.2804 15.5681 17.8498 16.4760 4.0971 3.1905 22.0379 8.6783 148.8687 44.3392 33.5522 0.6957 32.5620 3.1653 4.4844 1.1061 8.5083 215.9810 85.6796 64.5697 11.9977 8.9025 1.7941 1.1525 10.4267 6.2161 7.4103 6.3192 66.4972 12.5801 64.9041 15.8025 3.1967 3.9534 226.8257 11.5142 10.2635 4.1752 1.3876 13.7621 57.4878 32.3586 5.2376 562.7307 122.6413 11.4327 5.2357 35.5644 333.3523 276.8689 205.1003 66.1233 59.0247 35.2023 1021.3219 3.4110 976.7947 451.8928 36.5869 13.3189 9.4431 8.4053 9.0407 8.9202 3.0680 5.9793 11.2324 1.2371 3.8021 2.2802 3.2921 2.7653 2.8835 11.8984 3.8465 3.3300 4.1509 2.9422 4.0958 10.9524 2.9230 8.5679 8.9543 7.0964 1.4655
temp: 298.150 k
press: 1.00000 atm
elementType: 6 6 6 1 6 6 1 6 1 1 8 7 27 8 6 8 6 1 1 1 6 6 6 6 6 6 8 6 1 1 1 6 1 1 1 6 1 1 1 6 1 1 1 6 1 1 1 6 1 1 1 6 1 1 1
symmnumber: 1
zpe: 1184422.5 jmol-1
zpe.correction: 0.451123 hartree
zpe.thermalcorrener: 0.481923 hartree
zpe.thermalcorrenthalpy: 0.482867 hartree
zpe.thermalcorrgfe: 0.389882 hartree
zpe.sumelectzpe: -2552.598976 hartree
zpe.sumelectthermal: -2552.568176 hartree
zpe.sumelectthermalent: -2552.567231 hartree
zpe.sumelectthermalfe: -2552.660216 hartree
dipole: 7.6740 10.1161 -5.1454
dipole: 13.7004
quadrupole: -157.1861 -158.9871 -161.2686
quadrupole: -9.8699 0.0282 10.3631
quadrupole: 1.9611 0.1602 -2.1213 -9.8699 0.0282 10.3631
hfenergy: -2553.0500983 hartree
pointgroup: C01 [X(C21H28Co1N1O4)]
dipole: -3.019187 -3.9799759 -2.0243385 debye
polarizability: 478.9529211|-6.6080495|375.6956395|2.3270055|-21.225372|343.2016665 unknown
InChI: InChI=1S/C10H15.C9H10NO2.C2H3O2.Co/c1-6-7(2)9(4)10(5)8(6)3;1-7-3-5-9(6-4-7)12-10-8(2)11;1-2(3)4;/h1-5H3;3-6H,1-2H3;1H3;/q;2*-1;+2
charge 0 multiplicity 1
55 atoms
C  -2.625382 0.120583 1.341135
C  -3.898235 0.36646 0.831665
C  -1.479317 0.679601 0.757567
H  -0.547202 0.729935 1.36584
C  -3.997779 1.224541 -0.281641
C  -1.613753 1.499101 -0.3698
H  -4.986048 1.444997 -0.696363
C  -2.881064 1.786456 -0.884299
H  -2.969844 2.42602 -1.765182
H  -2.508507 -0.503931 2.230836
O  -0.54313 1.98681 -1.028403
N  0.65676 1.397148 -0.597481
Co 0.467582 -0.40469 0.042156
O  0.827513 1.680378 2.500708
C  1.727983 0.857289 2.321137
O  1.662052 -0.146685 1.521097
C  3.044445 0.97912 3.046914
H  3.391829 -0.002481 3.399211
H  2.965618 1.681638 3.886415
H  3.788972 1.357648 2.327988
C  1.030678 -2.413842 0.057694
C  -0.353634 -2.321822 -0.193121
C  -0.547173 -1.515511 -1.383605
C  0.733635 -1.139305 -1.868759
C  1.717915 -1.634576 -0.946232
C  1.721482 2.186311 -0.744517
O  2.865867 1.765607 -0.496901
C  1.495545 3.596048 -1.228615
H  0.77731 4.124766 -0.584568
H  2.459004 4.120904 -1.222802
H  1.083435 3.598681 -2.249476
C  -5.125323 -0.247127 1.43722
H  -5.626408 -0.921321 0.722965
H  -4.878634 -0.831694 2.334957
H  -5.861476 0.521785 1.721648
C  -1.428915 -2.970807 0.600859
H  -1.486889 -4.037839 0.32685
H  -1.225997 -2.919761 1.67968
H  -2.409539 -2.520631 0.404912
C  1.687392 -3.137817 1.173248
H  2.102405 -4.089323 0.800901
H  2.517444 -2.552067 1.590917
H  0.979497 -3.369685 1.980023
C  3.190961 -1.480433 -1.038827
H  3.474284 -0.65779 -1.70631
H  3.628397 -1.288914 -0.049158
H  3.636653 -2.411713 -1.427669
C  1.005455 -0.333594 -3.085219
H  0.200586 0.387497 -3.2797
H  1.954295 0.212255 -3.004485
H  1.075259 -1.0073 -3.955922
C  -1.850361 -1.265363 -2.05139
H  -2.663084 -1.129972 -1.325532
H  -1.811752 -0.381765 -2.701049
H  -2.107379 -2.134096 -2.681277
