program: Gaussian 09
title: 000033669
version: EM64L-G09RevD.01
frameworkgroup: C1[X(C11H17Cl)]
method: RPBEPBE
basis: SDD
operation: Freq
keyword: #p
keyword: freq=noraman
keyword: PBEPBE/SDD
title: #p freq=noraman PBEPBE/SDD
converged: NO YES NO NO
title: Mulliken charges:
elementType: Cl C C C C C C C C C C C H H H H H H H H H H H H H H H H H
charge: -0.101713 -0.078426 -0.083197 -0.052693 -0.052542 -0.428484 -0.417505 -0.416478 -0.432940 -0.433963 -0.477221 -0.476219 0.202846 0.195987 0.195943 0.216874 0.217132 0.210200 0.214637 0.214162 0.210269 0.187454 0.188868 0.188815 0.187505 0.205283 0.205230 0.204937 0.205240
chargesum: 0.00000
title: Mulliken charges with hydrogens summed into heavy atoms:
elementType: Cl C C C C C C C C C C C
charge: -0.101713 -0.078426 0.119650 0.143294 0.143401 0.005522 0.007331 0.007953 -0.056617 -0.057642 -0.066708 -0.066042
polarizability: 1.33389401e+02 -1.62974451e+00 1.08077018e+02 2.39435861e-01 4.29095234e-02 1.08270230e+02
1716.lowfreq: -27.0672 -12.8403 0.0017 0.0030 0.0031 19.8069 74.9394 174.3780 201.8125
frequency: 74.9376 174.3563 201.7766 233.5175 296.0740 321.0332 346.1284 347.2772 363.9398 394.4685 398.9411 411.2510 511.1727 560.5999 649.6543 695.0248 752.2555 764.8119 783.5529 784.8079 793.2501 859.5375 904.9125 911.4708 919.0142 919.2163 948.4654 954.9629 960.4054 1000.1100 1052.7417 1062.9440 1070.4757 1077.8934 1097.8253 1130.3046 1147.5338 1155.2372 1200.0195 1213.6060 1229.0375 1231.9196 1248.8596 1285.4294 1286.1894 1297.3114 1299.9354 1310.4155 1314.7960 1333.3440 1342.4989 1345.9537 1349.0287 1354.8540 1357.5578 1366.8301 1379.2475 1454.8088 1457.4021 1459.1909 1466.2361 1471.9759 1479.7222 1494.3333 2949.2476 2951.6380 2961.5725 2964.5550 2972.7602 2982.8549 2988.3916 2994.1513 2996.8032 3002.3656 3005.7820 3015.3307 3019.8207 3034.0327 3047.3870 3054.6961 3060.6524
redmass: 1.8579 4.4223 4.0667 2.3995 7.6598 2.7679 2.0926 3.5862 4.1156 1.8592 2.3364 1.9484 2.0572 4.1536 4.6296 4.7687 2.7987 2.6911 3.4205 1.3750 3.1018 1.5269 2.5300 1.8668 2.2127 2.2661 2.4003 2.2727 3.2299 1.8810 1.9182 1.7362 2.2993 1.5651 1.3097 1.3395 1.3468 1.2832 1.2798 1.1300 1.2271 1.0997 2.1303 1.7161 1.2734 1.6203 1.5141 2.1065 1.5218 1.5884 1.3064 1.5922 1.4528 1.4025 1.4245 1.5428 1.3509 1.0807 1.0884 1.0838 1.0876 1.0778 1.0965 1.0843 1.0715 1.0734 1.0601 1.0694 1.0692 1.0687 1.0690 1.0630 1.0637 1.1017 1.0690 1.1020 1.1015 1.1018 1.1033 1.1022 1.1037
irintensity: 0.0356 1.2717 1.2576 0.3058 13.2856 0.2524 0.4095 1.3714 0.1596 0.0299 0.0463 9.0825 0.0040 2.7951 17.8284 15.4056 3.7355 12.2131 7.9401 1.7210 0.3196 0.0004 6.4761 0.4995 0.2645 7.0214 10.5709 1.9501 21.0742 0.0637 1.9132 0.8141 0.6154 4.2606 1.5424 2.9055 0.6779 2.0311 0.0038 0.8048 0.0453 1.7840 17.5640 13.4434 0.1205 4.3910 0.9056 3.4042 13.5037 0.0517 0.0180 0.2797 2.1734 2.4052 0.0683 0.3665 0.1167 0.3035 2.5860 8.4849 21.2633 11.1032 20.4114 5.4707 0.3459 6.7781 0.0324 9.0081 117.9202 72.8013 87.4797 81.6663 79.4206 0.3165 14.2674 11.2452 38.5424 83.1424 2.3304 48.4003 37.4258
temp: 298.150 k
press: 1.00000 atm
elementType: 17 6 6 6 6 6 6 6 6 6 6 6 1 1 1 1 1 1 1 1 1 1 1 1 1 1 1 1 1
symmnumber: 1
zpe: 676275.4 jmol-1
zpe.correction: 0.257580 hartree
zpe.thermalcorrener: 0.267656 hartree
zpe.thermalcorrenthalpy: 0.268600 hartree
zpe.thermalcorrgfe: 0.222554 hartree
zpe.sumelectzpe: -888.501772 hartree
zpe.sumelectthermal: -888.491695 hartree
zpe.sumelectthermalent: -888.490751 hartree
zpe.sumelectthermalfe: -888.536798 hartree
dipole: -3.2634 0.5428 -0.0781
dipole: 3.3091
quadrupole: -89.8185 -78.7960 -78.1164
quadrupole: 1.5325 -0.2144 0.0934
quadrupole: -7.5748 3.4476 4.1272 1.5325 -0.2144 0.0934
hfenergy: -888.7593513 hartree
pointgroup: C01 [X(C11H17Cl1)]
dipole: 1.2546281 -0.163565 -0.3068195 debye
polarizability: 132.7770247|-1.9230387|108.3626518|-3.7611805|0.163037|108.5969723 unknown
InChI: InChI=1S/C11H17Cl/c12-11-5-8-1-2-9(6-11)4-10(3-8)7-11/h8-10H,1-7H2
charge 0 multiplicity 1
29 atoms
Cl -3.184474 0.351949 0.666211
C  -1.308297 0.101142 0.19635
C  0.235493 -0.857761 -1.502396
C  0.751092 1.49272 -0.492159
C  0.775162 -1.171318 1.030785
C  -1.264887 -0.659484 -1.135199
C  -0.718562 1.511585 0.036658
C  -0.696712 -0.741982 1.327658
C  0.902241 0.528663 -1.704236
C  0.917975 -1.727909 -0.415207
C  1.808774 1.273955 0.62241
C  1.826207 -0.087832 1.393779
H  0.28954 -1.406594 -2.464303
H  0.946718 2.518191 -0.87113
H  0.987534 -2.014441 1.721725
H  -1.787259 -0.083236 -1.921356
H  -1.775138 -1.635495 -1.034994
H  -0.76721 2.054718 0.999071
H  -1.354574 2.064174 -0.680808
H  -1.320202 -1.648504 1.447274
H  -0.745013 -0.186981 2.283326
H  0.438922 1.002761 -2.594094
H  1.978186 0.401009 -1.938578
H  1.992956 -1.856771 -0.653317
H  0.462395 -2.738938 -0.452744
H  1.682067 2.095773 1.355589
H  2.804187 1.435843 0.162446
H  2.825243 -0.553118 1.274609
H  1.720136 0.11768 2.477931
