program: Gaussian 09
title: 000033688
version: EM64L-G09RevD.01
frameworkgroup: C1[X(C8H13N3O3S)]
method: RPBEPBE
basis: SDD
operation: Freq
keyword: #p
keyword: freq=noraman
keyword: PBEPBE/SDD
title: #p freq=noraman PBEPBE/SDD
converged: YES YES NO NO
title: Mulliken charges:
elementType: S O O O N N N C C C C C C C C H H H H H H H H H H H H H
charge: 0.945812 -0.707470 -0.587147 -0.565170 -0.143084 -0.296144 -0.283339 0.420735 0.337539 -0.345603 -0.308677 -0.392777 -0.352064 -0.642786 -0.644467 0.256874 0.243504 0.320043 0.274282 0.427319 0.247683 0.222204 0.248153 0.224979 0.244125 0.242955 0.251143 0.361379
chargesum: 0.00000
title: Mulliken charges with hydrogens summed into heavy atoms:
elementType: S O O O N N N C C C C C C C C
charge: 0.945812 0.081228 -0.587147 -0.565170 -0.143084 -0.296144 -0.032196 0.420735 0.337539 -0.088729 -0.065173 -0.072734 -0.077781 0.075254 0.067591
polarizability: 2.49909081e+02 4.76234928e+01 1.87774756e+02 8.56859181e+00 -1.66537334e+00 7.91165554e+01
1716.lowfreq: -13.3371 -8.4372 -0.0021 -0.0007 0.0016 2.0273 24.6300 32.6278 40.5651
frequency: 24.4863 32.6184 40.5438 53.5613 69.6912 79.1371 89.1840 111.6065 127.1478 173.8733 178.8372 188.5335 191.3596 212.8317 275.3938 277.4714 323.1362 359.8474 374.0912 383.8200 432.1578 456.0341 465.1100 489.8717 520.6463 601.4829 631.2994 704.7129 725.2038 734.0865 815.7469 831.0358 832.3427 846.9656 875.2975 916.6588 935.8294 982.2522 988.6627 1002.5492 1055.9844 1099.4995 1111.9553 1136.0250 1165.3168 1183.5713 1240.7629 1250.1968 1275.1493 1315.0946 1342.8797 1377.1736 1399.0313 1432.4733 1453.6725 1466.2048 1467.4060 1474.2105 1479.7634 1491.0374 1501.2188 1528.4931 1551.7746 1593.7828 1629.4959 2000.6604 2958.6006 2965.6471 3031.0262 3036.0170 3097.6548 3106.8641 3117.1424 3155.0823 3174.8106 3178.2277 3202.6561 3628.6828
redmass: 8.9740 5.3480 5.3213 5.1590 4.0295 2.7200 7.5305 8.4537 1.3587 3.4117 4.5642 1.3219 4.0549 6.0874 3.8550 3.2235 5.2258 3.5904 4.5494 6.6632 2.8519 1.6433 3.5887 3.4058 2.3858 5.1936 6.6717 1.2163 4.8090 2.6799 1.2971 3.6677 1.7344 13.3736 1.3759 14.0416 3.0765 2.8254 1.3469 1.3453 1.5300 1.2376 1.3363 1.4035 1.6935 1.4849 1.8401 2.7573 1.0952 1.9188 2.0278 2.8536 4.3796 1.1642 1.2493 1.0409 2.7539 1.7008 1.0453 1.2392 1.2054 2.5019 5.6534 1.0702 6.0111 1.0883 1.0366 1.0385 1.1006 1.1023 1.0956 1.0975 1.0955 1.0870 1.0948 1.0934 1.0752 1.0656
irintensity: 2.6701 2.6010 1.0636 2.3442 0.6262 0.8021 1.5237 11.9485 3.8668 10.1846 1.9310 2.2511 13.8138 98.0420 3.8899 14.1664 43.9512 47.1303 16.9529 2.2852 13.7870 111.7684 1.0179 0.4225 37.8061 11.1078 4.9335 2.8907 20.7088 8.5551 3.4301 29.4456 21.4299 26.7866 93.8923 114.6655 21.3966 0.6959 4.3104 4.9113 24.4629 0.1951 0.8797 8.5769 8.7416 213.8393 27.1988 24.3123 19.0941 147.8890 196.9529 123.5782 26.1148 5.4500 76.7286 1.1569 12.7907 152.6813 26.0056 6.7050 41.5588 110.0362 62.9523 71.1695 378.7006 4126.6012 73.0997 90.3310 16.5897 45.7067 60.0759 4.1198 36.9197 2.3171 8.1493 11.8574 1.2026 35.5758
temp: 298.150 k
press: 1.00000 atm
elementType: 16 8 8 8 7 7 7 6 6 6 6 6 6 6 6 1 1 1 1 1 1 1 1 1 1 1 1 1
symmnumber: 1
zpe: 550463.8 jmol-1
zpe.correction: 0.209661 hartree
zpe.thermalcorrener: 0.227524 hartree
zpe.thermalcorrenthalpy: 0.228469 hartree
zpe.thermalcorrgfe: 0.161065 hartree
zpe.sumelectzpe: -1099.342479 hartree
zpe.sumelectthermal: -1099.324616 hartree
zpe.sumelectthermalent: -1099.323671 hartree
zpe.sumelectthermalfe: -1099.391075 hartree
dipole: -8.5043 0.7750 -0.0862
dipole: 8.5400
quadrupole: -80.4022 -95.8939 -98.9668
quadrupole: 17.6081 -5.1526 4.6316
quadrupole: 11.3521 -4.1396 -7.2125 17.6081 -5.1526 4.6316
hfenergy: -1099.55214 hartree
pointgroup: C01 [X(C8H13N3O3S1)]
dipole: 3.2116508 -0.8937383 0.4187856 debye
polarizability: 265.8952266|20.4164186|148.9946435|-26.7065319|-39.4724713|101.9105227 unknown
InChI: InChI=1S/C8H11N3.O2S.H2O/c1-11(2)8-5-3-7(10-9)4-6-8;1-3-2;/h3-6,9H,1-2H3;;1H2
charge 0 multiplicity 1
28 atoms
S  -3.727561 1.56139 -1.436361
O  -3.57412 -0.020754 0.314036
O  -2.144043 1.760952 -1.760101
O  -4.316839 2.73853 -0.484256
N  3.818241 0.223546 -0.253407
N  -1.490583 -1.444068 0.762432
N  -1.720093 -2.595212 1.343617
C  2.521046 -0.19878 0.00138
C  -0.147102 -1.070233 0.534547
C  1.389934 0.554759 -0.462002
C  2.268235 -1.411502 0.740242
C  0.083784 0.129949 -0.198201
C  0.965293 -1.836733 0.996172
C  4.055735 1.470685 -1.001132
C  4.968131 -0.571793 0.209388
H  1.529643 1.472596 -1.03776
H  3.1027 -2.012261 1.111735
H  -0.756298 0.717197 -0.592754
H  0.773034 -2.757528 1.555627
H  -2.638251 -0.559429 0.453384
H  3.637435 1.416945 -2.025139
H  5.138823 1.647656 -1.082724
H  3.603001 2.341468 -0.488943
H  5.901338 -0.082883 -0.108593
H  4.95521 -1.592947 -0.21881
H  4.98711 -0.658604 1.313492
H  -2.76269 -2.687838 1.42703
H  -3.824012 0.543594 1.086502
