program: QuantumEspresso
programVersion: 6.3
elementType: Cu O C
subdivisionN: 3 3 1
lattice: 10.901531 -0.000000 -0.000000 angstrom
lattice: 0.000000 10.901531 -0.000000 angstrom
lattice: 0.000000 0.000000 50.000146 angstrom
elementType: Cu
elementType: O
elementType: C
formula: C2Cu54O2
InChI: InChI=1S/C2O2.54Cu/c3-1-2-4;;;;;;;;;;;;;;;;;;;;;;;;;;;;;;;;;;;;;;;;;;;;;;;;;;;;;;
58 atoms
Cu 1.661018 0.666702 3.579616
Cu 3.47301 0.662052 1.817005
Cu 1.656055 2.479007 1.817005
Cu 7.106821 2.479007 0.0000
Cu 7.091396 2.449232 3.568298
Cu 5.289855 0.662052 0.0000
Cu 5.284703 0.656702 3.579536
Cu 7.106821 0.662052 1.817005
Cu 5.289855 2.479007 1.817005
Cu 10.74062 7.929773 1.817005
Cu 10.74062 2.479007 0.0000
Cu 1.656055 0.662052 0.0000
Cu 8.923776 0.662052 0.0000
Cu 10.74062 0.662052 1.817005
Cu 8.923776 2.479007 1.817005
Cu 3.47301 6.112818 0.0000
Cu 3.472936 6.113049 3.579314
Cu 1.656055 4.295962 0.0000
Cu 1.650691 4.301244 3.574911
Cu 3.47301 4.295962 1.817005
Cu 1.656055 6.112818 1.817005
Cu 7.106821 6.112818 0.0000
Cu 10.740468 2.480363 3.573886
Cu 8.923776 9.746728 1.817005
Cu 8.924288 0.66171 3.579053
Cu 3.46744 2.474442 3.579468
Cu 3.47301 2.479007 0.0000
Cu 5.289855 4.295962 0.0000
Cu 5.289855 6.112818 1.817005
Cu 10.74062 6.112818 0.0000
Cu 10.759261 6.148105 3.672868
Cu 8.923776 4.295962 0.0000
Cu 8.898089 4.262567 3.637863
Cu 10.74062 4.295962 1.817005
Cu 8.923776 6.112818 1.817005
Cu 3.47301 9.746728 0.0000
Cu 3.477724 9.751179 3.579442
Cu 1.656055 7.929773 0.0000
Cu 1.681401 7.942546 3.569922
Cu 3.47301 7.929773 1.817005
Cu 1.656055 9.746728 1.817005
Cu 7.106821 9.746728 0.0000
Cu 7.110396 9.742939 3.574442
Cu 5.289855 7.929773 0.0000
Cu 5.292006 7.92854 3.574149
Cu 7.106821 7.929773 1.817005
Cu 5.289855 9.746728 1.817005
Cu 10.74062 9.746728 0.0000
Cu 10.754683 9.772376 3.569643
Cu 8.923776 7.929773 0.0000
Cu 8.954896 7.954164 3.666292
Cu 7.106821 4.295962 1.817005
Cu 5.260938 4.281015 3.568644
Cu 7.076136 6.082986 3.645012
C  8.310252 5.482188 5.193086
C  9.470935 6.685795 5.230059
O  7.886939 5.026655 6.250316
O  9.853362 7.09576 6.321143
fermiener: -3.0848 electronvolt
totalener: -158187.009634 electronvolt
