program: QuantumEspresso
programVersion: 6.3
elementType: Cu C H
subdivisionN: 3 3 1
lattice: 10.901531 0.000000 0.000000 angstrom
lattice: 0.000000 10.901531 0.000000 angstrom
lattice: 0.000000 0.000000 50.000146 angstrom
elementType: Cu
elementType: C
elementType: H
formula: C2HCu54
InChI: InChI=1S/C2H.54Cu/c1-2;;;;;;;;;;;;;;;;;;;;;;;;;;;;;;;;;;;;;;;;;;;;;;;;;;;;;;/h1H;;;;;;;;;;;;;;;;;;;;;;;;;;;;;;;;;;;;;;;;;;;;;;;;;;;;;;
57 atoms
Cu 1.6570 0.652558 3.600696
Cu 3.47301 0.662052 1.817005
Cu 1.656055 2.479007 1.817005
Cu 7.106821 2.479007 0.0000
Cu 7.062667 2.426691 3.582196
Cu 5.289855 0.662052 0.0000
Cu 5.261059 0.645386 3.602842
Cu 7.106821 0.662052 1.817005
Cu 5.289855 2.479007 1.817005
Cu 10.74062 7.929773 1.817005
Cu 10.74062 2.479007 0.0000
Cu 1.656055 0.662052 0.0000
Cu 8.923776 0.662052 0.0000
Cu 10.74062 0.662052 1.817005
Cu 8.923776 2.479007 1.817005
Cu 3.47301 6.112818 0.0000
Cu 3.476695 6.118153 3.592073
Cu 1.656055 4.295962 0.0000
Cu 1.665118 4.296779 3.570568
Cu 3.47301 4.295962 1.817005
Cu 1.656055 6.112818 1.817005
Cu 7.106821 6.112818 0.0000
Cu 10.748889 2.471474 3.572578
Cu 8.923776 9.746728 1.817005
Cu 8.929443 0.667096 3.592703
Cu 3.457312 2.454276 3.602389
Cu 3.47301 2.479007 0.0000
Cu 5.289855 4.295962 0.0000
Cu 5.289855 6.112818 1.817005
Cu 10.74062 6.112818 0.0000
Cu 10.753335 6.088991 3.679433
Cu 8.923776 4.295962 0.0000
Cu 8.861703 4.225248 3.666649
Cu 10.74062 4.295962 1.817005
Cu 8.923776 6.112818 1.817005
Cu 3.47301 9.746728 0.0000
Cu 3.462555 9.74468 3.600236
Cu 1.656055 7.929773 0.0000
Cu 1.655696 7.924383 3.581471
Cu 3.47301 7.929773 1.817005
Cu 1.656055 9.746728 1.817005
Cu 7.106821 9.746728 0.0000
Cu 7.102847 9.761027 3.571531
Cu 5.289855 7.929773 0.0000
Cu 5.284824 7.934419 3.571851
Cu 7.106821 7.929773 1.817005
Cu 5.289855 9.746728 1.817005
Cu 10.74062 9.746728 0.0000
Cu 10.739378 9.749648 3.581698
Cu 8.923776 7.929773 0.0000
Cu 8.895603 7.959088 3.67227
Cu 7.106821 4.295962 1.817005
Cu 5.242916 4.256702 3.581681
Cu 7.048752 6.050799 3.661755
C  8.769501 5.917699 4.681847
C  9.531316 6.772427 5.298938
H  9.863393 7.139816 6.258633
fermiener: -1.9492 electronvolt
totalener: -157067.878782 electronvolt
