program: QuantumEspresso
programVersion: 6.3
elementType: Cu C
subdivisionN: 3 3 1
lattice: 10.901531 0.000000 0.000000 angstrom
lattice: 0.000000 10.901531 0.000000 angstrom
lattice: 0.000000 0.000000 50.000146 angstrom
elementType: Cu
elementType: C
formula: CCu54
InChI: InChI=1S/C.54Cu
55 atoms
Cu 1.674446 0.662095 3.586916
Cu 3.47301 0.662052 1.817005
Cu 1.656055 2.479007 1.817005
Cu 7.106821 2.479007 0.0000
Cu 7.0936 2.448476 3.590026
Cu 5.289855 0.662052 0.0000
Cu 5.270397 0.663502 3.587102
Cu 7.106821 0.662052 1.817005
Cu 5.289855 2.479007 1.817005
Cu 10.74062 7.929773 1.817005
Cu 10.74062 2.479007 0.0000
Cu 1.656055 0.662052 0.0000
Cu 8.923776 0.662052 0.0000
Cu 10.74062 0.662052 1.817005
Cu 8.923776 2.479007 1.817005
Cu 3.47301 6.112818 0.0000
Cu 3.47358 6.112674 3.600535
Cu 1.656055 4.295962 0.0000
Cu 1.686644 4.282286 3.590237
Cu 3.47301 4.295962 1.817005
Cu 1.656055 6.112818 1.817005
Cu 7.106821 6.112818 0.0000
Cu 10.754561 2.448322 3.590315
Cu 8.923776 9.746728 1.817005
Cu 8.924105 0.661662 3.600498
Cu 3.47316 2.462861 3.586908
Cu 3.47301 2.479007 0.0000
Cu 5.289855 4.295962 0.0000
Cu 5.289855 6.112818 1.817005
Cu 10.74062 6.112818 0.0000
Cu 10.823856 6.113167 3.669042
Cu 8.923776 4.295962 0.0000
Cu 8.92435 4.211872 3.669882
Cu 10.74062 4.295962 1.817005
Cu 8.923776 6.112818 1.817005
Cu 3.47301 9.746728 0.0000
Cu 3.472411 9.764275 3.586954
Cu 1.656055 7.929773 0.0000
Cu 1.686912 7.943115 3.589958
Cu 3.47301 7.929773 1.817005
Cu 1.656055 9.746728 1.817005
Cu 7.106821 9.746728 0.0000
Cu 7.091087 9.779091 3.5905
Cu 5.289855 7.929773 0.0000
Cu 5.258708 7.944516 3.590437
Cu 7.106821 7.929773 1.817005
Cu 5.289855 9.746728 1.817005
Cu 10.74062 9.746728 0.0000
Cu 10.754926 9.777089 3.58999
Cu 8.923776 7.929773 0.0000
Cu 8.92203 8.014766 3.669727
Cu 7.106821 4.295962 1.817005
Cu 5.260667 4.28256 3.590075
Cu 7.022167 6.114993 3.670128
C  8.923291 6.115225 3.884802
fermiener: -1.7709 electronvolt
totalener: -156800.779079 electronvolt
