program: Gaussian 09
title: 000033659
version: EM64L-G09RevD.01
frameworkgroup: C1[X(C10H14O)]
method: RPBEPBE
basis: SDD
operation: Freq
keyword: #pfreq=noraman
keyword: PBEPBE/SDD
title: #p freq=noraman PBEPBE/SDD
converged: YES YES NO NO
title: Mulliken charges:
elementType: O C C C C C C C C C C H H H H H H H H H H H H H H
charge: -0.448849 0.194998 0.406428 -0.523423 -0.564011 0.161695 -0.440873 -0.692599 -0.425912 -0.679836 -0.215334 0.208994 0.239233 0.216363 0.213837 0.232098 0.240763 0.213635 0.211526 0.224324 0.215980 0.220530 0.214470 0.222609 0.353353
chargesum: 0.00000
title: Mulliken charges with hydrogens summed into heavy atoms:
elementType: O C C C C C C C C C C
charge: -0.095496 0.194998 0.406428 -0.075196 -0.133811 0.161695 -0.208775 -0.026675 -0.211443 -0.019002 0.007275
polarizability: 1.31030670e+02 -2.52278012e+00 1.26266335e+02 6.46554531e+00 6.41467584e+00 7.06914717e+01
1716.lowfreq: -9.3695 -6.5280 -0.0003 0.0005 0.0007 7.9018 71.4335 80.2588 95.4687
frequency: 71.3270 80.2408 95.4209 140.5687 204.3258 214.3521 215.1988 275.6898 323.2823 353.6854 355.0359 380.6137 465.2826 493.6374 527.4725 548.5684 612.6178 642.5449 738.4944 773.7624 781.4627 787.7409 798.4108 866.0901 893.0774 953.0387 967.8976 981.6694 1040.2481 1055.3643 1063.0661 1079.0683 1102.9475 1157.2476 1176.7211 1206.3693 1237.2891 1250.1135 1258.8970 1287.4353 1313.7556 1318.9341 1381.7596 1387.2910 1391.5510 1449.1787 1466.6257 1470.4555 1471.6670 1478.9544 1487.9488 1489.7965 1501.8257 1592.2173 1615.8047 2978.3950 2979.1446 2993.9934 3011.5282 3042.0288 3059.0685 3074.9386 3075.5957 3083.2362 3092.3130 3109.8243 3123.0742 3154.3143 3583.0380
redmass: 2.5065 3.2901 2.9718 3.2099 1.7656 1.2634 1.3257 2.9864 2.9240 1.6273 1.4267 3.4725 2.9082 4.1441 5.0140 3.7445 4.2537 3.6651 1.5893 1.5482 1.4937 2.5694 1.7524 1.3851 2.6105 1.3160 2.4401 2.1584 1.6914 2.0494 1.9623 1.6670 1.5908 1.4085 1.3091 2.0249 1.5124 1.6339 1.8644 1.2539 1.5776 1.4496 1.2123 1.2367 4.8639 2.4461 1.0802 1.0617 1.0686 1.3668 1.1110 1.6277 1.0988 6.7532 6.7791 1.0348 1.0349 1.0607 1.0601 1.1006 1.1004 1.0999 1.0999 1.1010 1.1012 1.0879 1.0896 1.0988 1.0659
irintensity: 0.1548 0.0523 0.0537 4.4107 0.4620 0.2384 0.3004 0.3858 9.2619 55.5824 73.1618 4.0491 1.3832 4.2066 1.3610 0.7705 0.1316 0.3959 52.2941 5.6293 2.5024 25.4214 7.4019 0.4877 62.9496 1.0488 7.7131 5.4269 2.6660 17.1639 24.9382 48.6323 27.4821 50.0613 10.5054 7.6200 27.2408 21.0068 26.2878 7.1149 1.6710 0.7320 8.2092 15.9975 6.4592 37.9034 5.0796 12.5478 5.5046 1.2212 13.5244 13.6174 5.6055 39.0873 10.5901 39.9126 40.6129 32.6815 24.9971 8.7328 6.0254 59.7358 49.6738 40.3186 38.1444 10.6585 20.2407 26.8327 26.1122
temp: 298.150 k
press: 1.00000 atm
elementType: 8 6 6 6 6 6 6 6 6 6 6 1 1 1 1 1 1 1 1 1 1 1 1 1 1
symmnumber: 1
zpe: 560058.9 jmol-1
zpe.correction: 0.213315 hartree
zpe.thermalcorrener: 0.224811 hartree
zpe.thermalcorrenthalpy: 0.225756 hartree
zpe.thermalcorrgfe: 0.176409 hartree
zpe.sumelectzpe: -463.850622 hartree
zpe.sumelectthermal: -463.839126 hartree
zpe.sumelectthermalent: -463.838182 hartree
zpe.sumelectthermalfe: -463.887528 hartree
dipole: 0.5135 -0.7949 0.0278
dipole: 0.9467
quadrupole: -56.0955 -64.9522 -70.5716
quadrupole: -3.6381 2.2416 0.5798
quadrupole: 7.7776 -1.0791 -6.6985 -3.6381 2.2416 0.5798
hfenergy: -464.0639373 hartree
pointgroup: C01 [X(C10H14O1)]
dipole: -0.2591226 -0.2674001 -0.0095465 debye
dipolederiv: -0.6960058 0.5651737 -0.1574862 0.650753 -0.7038309 0.1571719 -0.1847766 0.1259714 -0.4515886 -0.2696798 0.2867209 -0.0368029 0.0697608 0.164146 -0.0091121 -0.0287277 -0.0101794 -0.1171342 0.3370133 -0.0242041 -0.0048439 0.0198116 0.0813668 -0.0507622 0.0177944 -0.0338683 -0.0685364 0.1491375 -0.0045206 -0.0135588 0.0049925 -0.0224967 -0.0104707 -0.0409984 -0.0956998 0.0763139 -0.0041233 -0.0159715 0.0359586 -0.0073663 0.1455688 -0.0079013 0.1368253 -0.0102863 0.0824921 0.6699101 -0.557523 0.1844172 -0.5489608 0.5530501 -0.1869415 0.203062 -0.1552258 0.1185826 -0.2026102 -0.1012108 0.0385801 -0.1205957 -0.10379 -0.0313686 0.0232065 -0.0318592 -0.1893067 0.0468496 -0.0343254 0.0149915 -0.0121804 0.0259777 -0.0450202 0.048515 0.028989 0.0092224 -0.0638892 -0.0369754 0.0419403 0.2302543 -0.2385909 0.041348 -0.0302317 -0.0052385 -0.219127 0.006467 -0.0003631 0.0410898 -0.0168738 0.0671799 -0.0052299 -0.0372806 -0.0151027 -0.0048258 0.1471175 0.0622085 0.0256618 -0.0530366 0.0629417 -0.0664751 0.0521389 -0.0338451 -0.1183638 -0.141595 -0.039155 0.106238 -0.0085124 0.0400208 -0.0304933 0.0688518 -0.0237255 0.0235545 0.0495202 0.0609777 -0.0919845 0.0134843 0.0089344 0.0419423 -0.0527741 0.0529206 -0.0438256 0.021343 -0.0362183 0.007622 -0.0746648 -0.1057611 -0.1110942 0.0023155 -0.0760919 0.0155014 0.002748 0.0256681 -0.028865 0.0906512 -0.0327641 0.1310926 -0.052891 0.0851051 -0.0494274 -0.0104725 0.1130708 -0.0526707 0.0845475 -0.0258048 0.0425355 -0.0470088 0.0521417 0.1357777 -0.1050535 0.0444257 0.0960382 -0.0096552 0.1039823 -0.0075778 0.0504737 -0.000951 0.0524036 0.0710604 -0.0996635 0.0084071 -0.0917675 -0.2354345 -0.0013657 0.0088994 0.0037334 0.0635835 0.0078247 0.0370844 -0.1164782 0.0772288 0.0505075 0.0865729 -0.0867065 0.041527 -0.0624902 0.0947465 -0.0547444 -0.0092745 -0.0027494 -0.1180826 -0.1079781 0.0002235 -0.0543525 0.0366367 -0.2589115 -0.0271721 0.0194061 -0.0425438 0.0946158 -0.00645 0.0164868 -0.0087699 0.0631229 0.0708589 0.0710896 -0.0698815 0.0368819 -0.0186073 0.1227749 -0.0451949 0.0896154 -0.0291467 -0.1507214 -0.0273629 -0.0385894 0.0052261 0.0721786 0.020481 -0.0420497 0.0166441 0.1635066 0.0495203 -0.0773171 0.0041217 -0.0814902 -0.1010891 0.0466682 0.0017868 0.0474146 0.1461699 0.1789453 -0.129692 -0.0040368 -0.2131951 0.2357819 -0.0123467 0.0180603 0.0111334 0.3669046 unknown
polarizability: 132.0049766|1.2001572|125.7097528|3.7838573|-6.7070204|70.2737471 unknown
InChI: InChI=1S/C10H14O/c1-3-8-6-5-7-10(11)9(8)4-2/h5-7,11H,3-4H2,1-2H3
charge 0 multiplicity 1
25 atoms
O  -2.316221 1.262222 -0.562563
C  -0.080697 0.477078 -0.114635
C  0.8019 -0.584533 0.240065
C  0.386554 1.910434 -0.325921
C  2.307066 -0.364782 0.354332
C  -1.46701 0.180659 -0.228791
C  0.285542 -1.890849 0.453746
C  0.265996 2.762858 0.967158
C  -1.98116 -1.118873 -0.020878
C  3.034547 -0.533909 -1.007599
C  -1.092156 -2.160066 0.322061
H  1.432475 1.925369 -0.680462
H  -0.231387 2.379625 -1.111988
H  2.528664 0.638697 0.761914
H  2.725746 -1.094582 1.073109
H  0.974714 -2.698362 0.728054
H  -0.784711 2.801028 1.303422
H  0.608364 3.798972 0.788323
H  0.872855 2.335198 1.786593
H  2.869438 -1.547629 -1.414892
H  4.123677 -0.378607 -0.896372
H  2.657904 0.189915 -1.753075
H  -3.057006 -1.315291 -0.121176
H  -1.477585 -3.171539 0.490602
H  -3.251909 0.951767 -0.641926
