program: Gaussian 09
title: 000033689
version: EM64L-G09RevD.01
frameworkgroup: C1[X(C14H21Cl2NO)]
method: RPBEPBE
basis: SDD
operation: Freq
keyword: #p
keyword: freq=noraman
keyword: PBEPBE/SDD
title: #p freq=noraman PBEPBE/SDD
converged: YES YES NO NO
title: Mulliken charges:
elementType: Cl Cl O N C C C C C C C C C C C C C C H H H H H H H H H H H H H H H H H H H H H
charge: -0.064951 -0.066100 -0.267336 -0.176837 0.457229 -0.389734 -0.388353 -0.382227 -0.287164 -0.369659 -0.340861 0.350500 -0.342386 -0.582895 -0.584194 -0.373313 -0.414260 -0.686432 0.245691 0.247200 0.246377 0.246350 0.209822 0.210428 0.198761 0.198508 0.228694 0.232522 0.193516 0.192772 0.267122 0.292489 0.267706 0.292967 0.246314 0.249277 0.212482 0.212449 0.217526
chargesum: 0.00000
title: Mulliken charges with hydrogens summed into heavy atoms:
elementType: Cl Cl O N C C C C C C C C C C C C C C
charge: -0.064951 -0.066100 -0.267336 -0.176837 0.457229 0.103156 0.104374 0.038023 0.110105 -0.140965 -0.108339 0.350500 0.043903 -0.023285 -0.023521 -0.126999 -0.164983 -0.043974
polarizability: 2.73504534e+02 -1.45076525e+00 1.95587247e+02 -1.25256031e-01 1.62378093e+01 1.14529022e+02
1716.lowfreq: -5.8735 -4.5235 0.0006 0.0010 0.0022 7.5950 15.1118 29.5681 33.2068
frequency: 15.0213 29.5080 33.1991 42.4771 49.9966 64.3027 68.5500 89.7754 112.6907 129.5024 146.3171 154.1993 173.9211 198.6057 206.7843 231.2603 239.7369 250.6149 283.4696 317.8541 378.1556 388.3736 405.0716 420.2596 482.3090 514.2995 531.7484 548.3637 634.7428 657.7262 687.7100 708.3133 712.7225 743.4668 781.5095 787.5615 791.2564 802.1710 810.6894 818.2322 903.7583 910.3493 938.1567 941.6412 954.2317 972.7601 994.1007 996.8079 1033.1141 1034.3409 1039.8694 1042.0790 1083.3926 1119.9081 1123.6190 1134.5984 1146.0730 1178.3233 1188.6979 1213.5858 1225.6044 1232.5302 1252.5217 1254.5201 1272.5801 1276.1108 1279.8526 1283.8922 1294.8517 1318.6472 1345.5201 1352.5378 1354.6742 1367.6334 1383.5243 1385.2960 1392.3312 1433.4836 1457.1858 1458.1485 1470.2074 1474.2200 1477.1905 1481.9238 1483.0299 1491.2082 1502.1087 1510.1368 1575.2967 1635.7359 2936.0971 2965.9979 2975.4572 2991.5407 2994.1563 3007.8351 3009.7495 3013.6808 3057.9381 3062.5991 3062.8797 3065.3218 3070.6676 3074.1776 3075.8142 3143.9042 3145.9903 3148.1855 3148.4843 3164.5593 3169.6141
redmass: 5.3614 9.8848 8.3908 4.9779 2.6484 4.2966 2.1465 2.9946 2.7248 2.3605 2.0896 5.1655 4.2940 6.5431 4.2708 1.1105 4.5286 4.3637 3.6027 5.4833 3.6348 4.4427 3.2810 3.1970 3.6033 2.5104 4.0488 4.0540 6.9947 7.3454 5.3990 4.1036 3.7350 1.0760 1.1247 1.2376 1.2930 4.7169 1.5496 1.1942 1.7980 1.3543 1.2838 1.2109 2.8594 6.5041 2.7006 1.4140 4.4720 2.2497 2.3104 2.9375 2.1745 1.4827 2.4553 1.3612 1.4495 1.6534 1.4322 1.3742 2.2131 2.1768 1.1665 1.1668 1.3064 1.3953 1.1823 1.0630 1.2002 1.3565 1.4830 1.2520 1.4916 3.2164 1.8022 1.6354 1.2694 3.4335 1.0968 1.0986 1.0780 1.0725 1.0424 1.0887 1.0984 1.1193 1.1196 2.1754 7.0745 6.4611 1.0548 1.0590 1.0362 1.1058 1.0595 1.0601 1.1009 1.0608 1.1041 1.0714 1.0575 1.0887 1.1026 1.1014 1.0995 1.0878 1.0893 1.1095 1.1105 1.0952 1.0962
irintensity: 0.1041 0.8995 0.2410 1.4234 0.3509 0.8746 0.2943 1.7130 1.5654 1.4126 2.3629 0.2971 0.8942 0.8210 2.2822 0.0545 18.6128 0.5212 4.0050 7.9446 2.3095 5.2030 2.0723 0.3690 2.4575 17.7185 17.5496 12.4748 2.7213 34.2430 103.5522 69.1788 2.7787 11.3583 3.1700 11.0578 12.1856 5.5592 62.0224 14.8150 22.2151 0.5969 0.4716 1.2701 13.3652 86.0917 20.4784 4.5048 0.5064 0.2245 0.3055 36.7903 8.4637 39.6444 6.2410 10.7907 1.7619 65.2417 90.5737 0.1095 50.2633 267.9657 11.1609 15.2709 8.8209 13.8306 0.4055 0.0431 11.7873 6.1263 0.0985 0.7979 40.5267 3.0578 3.6562 53.0152 3.4226 13.1739 12.5636 10.6411 5.3583 4.4426 13.2593 24.3425 64.7575 57.1182 2.4231 436.0971 2.9279 8.2120 36.1019 34.7377 37.0734 30.8496 37.8991 30.0728 6.7337 14.6225 17.9898 14.8396 3.7701 23.0017 11.9522 102.2988 50.1790 25.5071 24.7611 7.8199 9.7320 23.1806 1.0961
temp: 298.150 k
press: 1.00000 atm
elementType: 17 17 8 7 6 6 6 6 6 6 6 6 6 6 6 6 6 6 1 1 1 1 1 1 1 1 1 1 1 1 1 1 1 1 1 1 1 1 1
symmnumber: 1
zpe: 851735.3 jmol-1
zpe.correction: 0.324409 hartree
zpe.thermalcorrener: 0.344847 hartree
zpe.thermalcorrenthalpy: 0.345791 hartree
zpe.thermalcorrgfe: 0.270936 hartree
zpe.sumelectzpe: -1594.769240 hartree
zpe.sumelectthermal: -1594.748801 hartree
zpe.sumelectthermalent: -1594.747857 hartree
zpe.sumelectthermalfe: -1594.822713 hartree
dipole: -2.2817 1.0384 0.4060
dipole: 2.5395
quadrupole: -121.8644 -139.3748 -123.2981
quadrupole: -3.8571 -2.3666 0.5372
quadrupole: 6.3147 -11.1957 4.8810 -3.8571 -2.3666 0.5372
hfenergy: -1595.0936484 hartree
pointgroup: C01 [X(C14H21Cl2N1O1)]
dipole: 0.887638 -0.4116376 0.2022451 debye
polarizability: 273.3718162|-2.0949589|193.5997953|3.4658258|-20.672516|116.6491919 unknown
InChI: InChI=1S/C14H21Cl2NO/c1-2-3-12-18-14-6-4-13(5-7-14)17(10-8-15)11-9-16/h4-7H,2-3,8-12H2,1H3
charge 0 multiplicity 1
39 atoms
Cl -5.150078 3.375381 -0.065342
Cl -4.176597 -3.961675 0.25399
O  2.8275 0.798135 -0.178995
N  -2.801919 -0.048921 0.032293
C  -1.392589 0.131879 -0.0121
C  -3.721574 0.986329 -0.461767
C  -3.394618 -1.278813 0.577399
C  5.181802 0.334501 0.11507
C  3.770965 -0.233301 0.285052
C  -0.496536 -0.888457 0.416359
C  -0.81545 1.34951 -0.489846
C  1.453272 0.506348 -0.096854
C  6.271299 -0.663904 0.570899
C  -3.985787 2.049343 0.622643
C  -3.447856 -2.382617 -0.496944
C  0.903721 -0.706641 0.37977
C  0.577193 1.528435 -0.53294
C  7.696099 -0.089933 0.415678
H  -4.680486 0.518194 -0.747157
H  -3.3252 1.469392 -1.37268
H  -4.420486 -1.067641 0.928105
H  -2.828838 -1.636254 1.456526
H  5.262849 1.27271 0.696833
H  5.335465 0.601602 -0.948146
H  3.56666 -0.474573 1.350408
H  3.640414 -1.158196 -0.317009
H  -0.873907 -1.847544 0.78371
H  -1.447361 2.174701 -0.8311
H  6.184408 -1.600839 -0.016415
H  6.099295 -0.941585 1.631086
H  -4.496804 1.629528 1.501884
H  -3.071021 2.578943 0.924682
H  -4.109483 -2.116738 -1.334753
H  -2.449818 -2.658194 -0.86618
H  1.546247 -1.523695 0.720924
H  1.006254 2.466168 -0.899606
H  7.905533 0.170782 -0.638668
H  7.820289 0.828566 1.019293
H  8.461445 -0.816824 0.743301
