program: Gaussian 09
title: 000033631
version: EM64L-G09RevD.01
frameworkgroup: C1[X(C9H17NO2)]
method: RPBEPBE
basis: SDD
operation: Freq
keyword: #p
keyword: freq=noraman
keyword: PBEPBE/SDD
title: #p freq=noraman PBEPBE/SDD
converged: YES YES NO NO
title: Mulliken charges:
elementType: O O N C C C C C C C C C H H H H H H H H H H H H H H H H H
charge: -0.416733 -0.236301 -0.334291 0.011852 -0.413658 -0.456457 -0.395613 -0.395794 -0.385481 -0.357716 -0.494822 0.185684 0.174802 0.205686 0.200548 0.180570 0.210414 0.199319 0.191291 0.192707 0.198703 0.196953 0.191134 0.238979 0.232479 0.194568 0.270453 0.235857 0.374868
chargesum: 0.00000
title: Mulliken charges with hydrogens summed into heavy atoms:
elementType: O O N C C C C C C C C C
charge: -0.041865 -0.236301 -0.095313 0.186654 -0.007424 -0.065473 -0.005003 -0.004383 0.002606 0.069331 0.011488 0.185684
polarizability: 1.38599361e+02 -1.20358536e+00 1.03420902e+02 -4.18268242e-01 3.51095749e+00 8.44107403e+01
1716.lowfreq: -22.8834 -0.0006 -0.0004 0.0002 4.9135 13.6736 23.3159 40.9104 63.0309
frequency: 21.0402 40.6756 62.8175 79.7394 119.2051 151.4914 214.4977 219.7119 229.3774 325.7504 359.5546 415.8100 441.6341 459.0542 484.4902 513.5132 545.9947 598.3992 645.0302 685.3936 780.9128 787.1772 797.8668 842.6984 867.1146 882.3697 892.3620 920.9626 964.7097 1025.3980 1037.8467 1050.4460 1052.7887 1063.6553 1078.5820 1109.6754 1114.3868 1143.8773 1150.0401 1167.1534 1204.7646 1239.8728 1245.1196 1251.7819 1258.1654 1270.3411 1300.7359 1309.5448 1323.7639 1334.6969 1340.8480 1342.3173 1344.2182 1366.4250 1394.2722 1441.4226 1460.5662 1462.4890 1463.5000 1469.6993 1471.0692 1478.6943 1493.7832 1667.6080 2826.9727 2877.9879 2958.2248 2966.3956 2968.4216 2969.3422 2980.1487 2995.9358 3017.4490 3028.7093 3030.6212 3037.3121 3041.3293 3046.8619 3062.8327 3400.3107 3512.2382
redmass: 6.8669 3.9728 3.8992 2.0239 2.9678 3.0544 4.0144 2.0656 3.4721 1.7827 3.3883 3.3923 3.1581 1.8616 2.8871 1.9685 2.1174 3.7862 1.3832 1.4206 2.0508 1.5635 1.3289 2.2225 2.7064 2.1253 1.5473 1.8852 2.3662 2.9213 2.5151 1.7478 1.2327 1.5334 1.9763 1.6229 2.5114 2.6339 3.1138 1.2308 1.5541 1.3455 1.4799 1.2799 1.2552 1.1375 1.2277 1.3407 1.4646 1.3710 1.4867 1.5248 1.5894 1.5119 1.6380 1.0840 1.1199 1.0912 1.0931 1.2057 1.0839 1.0962 1.0838 8.2273 1.0806 1.0723 1.0598 1.0630 1.0598 1.0666 1.0611 1.0603 1.0990 1.0963 1.0983 1.1015 1.0942 1.1030 1.0932 1.0737 1.0639
irintensity: 1.0165 0.0120 0.1188 1.0391 2.8946 1.5594 1.3738 0.0750 1.6835 1.6005 1.7705 10.5102 0.3065 3.1150 20.9790 32.1930 22.8299 27.6472 119.7003 73.6058 0.8899 1.4291 7.2086 5.0063 8.9576 2.2742 10.8203 3.2386 4.0219 233.4234 26.9030 4.8637 17.9720 11.2667 22.8948 24.0990 10.3778 13.3088 23.4580 11.0257 2.0927 0.3864 4.7582 5.4800 2.2760 26.3817 1.7511 1.8737 23.3425 0.2808 1.4178 21.8659 10.7112 46.7141 19.3986 30.0228 1.8142 3.2921 9.7346 14.8685 21.0221 3.1193 3.6249 205.5819 74.6784 94.3710 45.0398 33.8598 43.3946 35.9422 23.9262 14.2560 55.1737 70.2530 36.0503 10.5107 7.0865 127.7332 30.0319 5.1615 19.2127
temp: 298.150 k
press: 1.00000 atm
elementType: 8 8 7 6 6 6 6 6 6 6 6 6 1 1 1 1 1 1 1 1 1 1 1 1 1 1 1 1 1
symmnumber: 1
zpe: 663927.4 jmol-1
zpe.correction: 0.252877 hartree
zpe.thermalcorrener: 0.265674 hartree
zpe.thermalcorrenthalpy: 0.266618 hartree
zpe.thermalcorrgfe: 0.211847 hartree
zpe.sumelectzpe: -557.385925 hartree
zpe.sumelectthermal: -557.373128 hartree
zpe.sumelectthermalent: -557.372184 hartree
zpe.sumelectthermalfe: -557.426955 hartree
dipole: -0.5318 -1.5099 0.3276
dipole: 1.6340
quadrupole: -67.2625 -76.7489 -75.0840
quadrupole: -3.0670 -1.4077 -3.1878
quadrupole: 5.7693 -3.7171 -2.0522 -3.0670 -1.4077 -3.1878
hfenergy: -557.6388018 hartree
pointgroup: C01 [X(C9H17N1O2)]
dipole: 0.2252339 -0.5840787 -0.1462164 debye
polarizability: 138.514026|2.1389008|103.7077276|-0.0417532|-2.9120896|84.2092497 unknown
InChI: InChI=1S/C9H17NO2/c11-9(12)6-7-10-8-4-2-1-3-5-8/h8,10-11H,1-7H2
charge 0 multiplicity 1
29 atoms
O  -4.928498 -0.681082 0.231914
O  -3.86814 1.252961 -0.491233
N  -0.064008 -0.771905 0.160796
C  1.249481 -0.228908 -0.277196
C  1.614769 1.061263 0.49854
C  2.337327 -1.306103 -0.056255
C  3.014346 1.58564 0.095426
C  3.741076 -0.796386 -0.457474
C  4.101875 0.504113 0.299532
C  -1.255732 -0.02444 -0.294191
C  -2.521978 -0.678969 0.284968
C  -3.784444 0.087178 -0.04608
H  1.237558 0.024693 -1.370853
H  1.591682 0.824155 1.580964
H  0.855212 1.846896 0.321835
H  2.084623 -2.218633 -0.636168
H  2.3308 -1.589282 1.016009
H  3.258642 2.491686 0.68288
H  3.00062 1.892517 -0.97139
H  3.763694 -0.601003 -1.549649
H  4.497275 -1.57995 -0.25741
H  5.086949 0.881824 -0.037054
H  4.19398 0.281085 1.382612
H  -0.139557 -1.768421 -0.095879
H  -1.194342 1.015515 0.069996
H  -1.340244 0.036511 -1.40742
H  -2.427399 -0.737973 1.387182
H  -2.642243 -1.721619 -0.066424
H  -5.739624 -0.138064 0.033723
