program: Gaussian 09
title: 000033670
version: EM64L-G09RevD.01
frameworkgroup: C1[X(C17H14N4O4)]
method: RPBEPBE
basis: SDD
operation: Freq
keyword: #p
keyword: freq=noraman
keyword: PBEPBE/SDD
title: #p freq=noraman PBEPBE/SDD
converged: YES YES NO NO
title: Mulliken charges:
elementType: O O O O N N N N C C C C C C C C C C C C C C C C C H H H H H H H H H H H H H H
charge: -0.259369 -0.263937 -0.199224 -0.199015 -0.342260 -0.035081 -0.392218 0.017556 0.242933 0.293080 -0.015045 -0.525419 -0.273182 -0.601882 0.200644 0.320465 0.408777 -0.402787 0.288461 -0.358393 -0.376333 -0.233265 -0.227322 -0.233658 -0.608510 0.324571 0.276570 0.248056 0.279166 0.294490 0.256875 0.274186 0.375144 0.234361 0.232659 0.234850 0.272016 0.234213 0.237826
chargesum: 0.00000
title: Mulliken charges with hydrogens summed into heavy atoms:
elementType: O O O O N N N N C C C C C C C C C C C C C C C C C
charge: -0.259369 -0.263937 -0.199224 -0.199015 -0.342260 -0.035081 -0.017074 0.017556 0.242933 0.293080 -0.015045 -0.200848 0.003388 -0.074660 0.200644 0.320465 0.408777 -0.108296 0.288461 -0.101518 -0.102147 0.001096 0.005337 0.001193 0.135544
polarizability: 2.95256614e+02 -3.08789350e-01 2.61655083e+02 -2.18042278e+01 1.98123201e+01 1.69531012e+02
1716.lowfreq: -0.0005 0.0001 0.0007 2.0660 5.4314 9.9011 31.4722 44.5578 51.8105
frequency: 31.4624 44.5439 51.7786 52.4067 56.9250 62.6628 68.1822 90.5244 128.8555 149.5368 157.5277 174.6615 187.1528 222.8190 244.8006 263.1831 274.8795 307.6164 327.1571 350.9076 360.8244 404.1508 414.2764 418.8361 425.7250 453.5013 465.0041 499.1970 509.5172 530.8183 565.6566 583.0272 615.4117 635.2550 655.6543 667.0129 696.8235 701.5088 709.2354 717.9574 726.4878 751.2199 773.1656 790.5997 831.6871 839.9521 846.6681 859.7079 897.7125 937.7205 940.4156 950.1114 957.5124 977.9795 982.2453 988.7915 989.7012 1004.9236 1011.4350 1029.0725 1059.9398 1087.0933 1091.4826 1122.2477 1134.2282 1140.5390 1155.5112 1174.9912 1182.1988 1190.9677 1203.5990 1212.4255 1242.8445 1256.1015 1284.4900 1305.6928 1319.4008 1324.1557 1368.8644 1383.8103 1390.1986 1414.9283 1423.1637 1435.9467 1458.8526 1466.5751 1472.0249 1483.6902 1486.0909 1527.9988 1544.4512 1580.0639 1589.5804 1597.9559 1610.2480 1613.3547 1682.1226 2952.3527 2988.5648 3069.8774 3112.1304 3121.6713 3130.8253 3139.0715 3150.6179 3162.5224 3172.4672 3178.3381 3179.7784 3196.8008 3300.5141
redmass: 5.3993 5.6201 4.2132 6.5597 1.4694 3.2052 5.4835 6.0154 7.5195 4.3256 6.0377 6.0882 4.5653 5.0555 5.6031 6.4420 6.1428 5.3257 5.3798 6.1822 6.3836 2.8688 7.5547 5.3675 4.8537 8.5542 4.3110 3.6599 6.1403 4.8806 5.2683 5.0014 6.4491 5.7386 5.7380 7.2152 3.1077 2.9975 5.7818 5.5227 8.2097 3.8258 4.2982 2.3760 3.3167 1.8106 1.1711 1.2482 3.6456 3.5226 1.6413 1.8865 3.5226 2.9425 1.7170 1.5292 4.4470 1.3392 2.4715 2.0810 5.4692 1.5862 2.0004 1.2985 2.1893 2.0099 1.6281 1.0617 1.9332 1.1482 1.9127 7.2092 3.5428 2.0025 2.1883 3.3028 1.4828 1.2882 8.3320 8.3690 8.4776 5.3255 1.1773 2.2734 1.1191 1.4750 1.6407 2.4266 1.0471 2.0967 6.5161 7.1784 6.9506 3.9147 6.1196 6.4303 8.0901 1.0682 1.0352 1.1021 1.0938 1.0993 1.0851 1.0884 1.0932 1.0962 1.1005 1.0920 1.0893 1.0975 1.0830
irintensity: 0.6314 0.2484 0.2788 0.0616 0.3919 0.6107 2.9530 1.4004 5.9598 0.7494 2.3388 6.8124 2.9885 0.3482 0.9871 1.4789 3.7003 9.9609 6.9655 9.2642 27.9700 0.2124 2.8518 2.3582 0.8376 3.4769 1.8646 5.4073 2.0824 4.3567 6.7281 12.2333 0.1798 21.4918 22.2074 0.7864 24.3249 48.0153 3.2379 6.4788 4.0074 50.8386 2.0640 21.3796 6.3113 4.5818 139.7096 4.3835 12.1337 10.3519 8.0586 19.3364 3.9279 7.3388 4.2800 4.5197 0.7367 0.7731 23.6741 9.0720 74.4461 12.8944 59.7605 0.4538 24.7793 118.1023 46.3977 1.0787 60.5314 15.1873 60.1601 355.1943 77.2505 57.0284 47.6606 50.5073 23.4738 3.5622 116.3294 8.4654 38.6135 22.5618 35.8736 14.7667 18.6700 129.4582 14.0339 4.0110 14.0629 489.8287 91.6143 11.2942 10.1802 60.1454 8.2503 13.1529 381.8550 26.0955 71.3171 27.4954 9.8756 3.8365 1.0291 4.2219 23.7530 14.7491 19.9262 2.7172 1.8715 3.6755 193.1585
temp: 298.150 k
press: 1.00000 atm
elementType: 8 8 8 8 7 7 7 7 6 6 6 6 6 6 6 6 6 6 6 6 6 6 6 6 6 1 1 1 1 1 1 1 1 1 1 1 1 1 1
symmnumber: 1
zpe: 755067.6 jmol-1
zpe.correction: 0.287590 hartree
zpe.thermalcorrener: 0.308795 hartree
zpe.thermalcorrenthalpy: 0.309739 hartree
zpe.thermalcorrgfe: 0.236014 hartree
zpe.sumelectzpe: -1174.291502 hartree
zpe.sumelectthermal: -1174.270297 hartree
zpe.sumelectthermalent: -1174.269353 hartree
zpe.sumelectthermalfe: -1174.343078 hartree
dipole: 2.7823 -2.4573 -0.3310
dipole: 3.7268
quadrupole: -138.1142 -156.5494 -140.8366
quadrupole: 22.2212 -0.7935 -7.3433
quadrupole: 7.0525 -11.3826 4.3301 22.2212 -0.7935 -7.3433
hfenergy: -1174.5790918 hartree
pointgroup: C01 [X(C17H14N4O4)]
dipole: -0.9949676 1.070137 -0.1212268 debye
polarizability: 293.575772|-3.6383686|263.4963204|23.5271699|-18.4354104|169.370617 unknown
InChI: InChI=1S/C17H14N4O4/c1-18-17(23)20-14-8-7-12(21(24)25)9-13(14)16(19-10-15(20)22)11-5-3-2-4-6-11/h2-9,18H,10H2,1H3
charge 0 multiplicity 1
39 atoms
O  -3.330125 1.822133 -1.615987
O  -2.939457 -0.791534 1.656642
O  1.666537 -4.994987 -0.11142
O  3.226337 -3.342113 -0.31575
N  -2.211728 0.123107 -0.416317
N  0.023971 1.778627 -1.610735
N  -4.277648 0.816903 0.610777
N  2.006276 -3.755637 -0.234132
C  0.243733 -0.403517 -0.469578
C  -1.119126 -0.826329 -0.396899
C  0.624063 1.027131 -0.704837
C  1.263738 -1.38634 -0.40619
C  -1.434376 -2.20328 -0.261674
C  -1.099684 1.18445 -2.378907
C  -2.321629 1.07079 -1.465836
C  1.758631 1.624518 0.058432
C  0.921944 -2.742997 -0.2835
C  -0.421943 -3.171544 -0.208956
C  -3.183645 0.006603 0.711304
C  2.13278 1.131572 1.338547
C  2.455105 2.739465 -0.48351
C  3.186199 1.738218 2.056569
C  3.508943 3.338676 0.232693
C  3.880059 2.839321 1.505411
C  -5.287799 0.86173 1.675007
H  2.317018 -1.100222 -0.46442
H  -2.481009 -2.505508 -0.190477
H  -0.851705 0.186201 -2.80033
H  -1.368556 1.869333 -3.195467
H  -0.647275 -4.236234 -0.113414
H  1.587626 0.293143 1.785274
H  2.147365 3.118365 -1.46277
H  -4.3415 1.429532 -0.221044
H  3.461288 1.354775 3.044897
H  4.044336 4.192132 -0.197313
H  4.701169 3.305327 2.061288
H  -5.027972 0.120702 2.446299
H  -6.286666 0.624299 1.267383
H  -5.321977 1.863889 2.140041
