program: Gaussian 09
title: 000033654
version: EM64L-G09RevD.01
frameworkgroup: C1[X(C14H17ClO2)]
method: RPBEPBE
basis: SDD
operation: Freq
keyword: #p
keyword: freq=noraman
keyword: PBEPBE/SDD
title: #p freq=noraman PBEPBE/SDD
converged: YES YES NO NO
title: Mulliken charges:
elementType: Cl O O C C C C C C C C C C C C C C H H H H H H H H H H H H H H H H H
charge: -0.076679 -0.402572 -0.247627 0.005467 -0.534437 -0.533852 0.524834 0.155694 -0.428314 -0.449472 0.591696 -0.343034 -0.378805 -0.586258 -0.020485 -0.697698 -0.713621 0.275802 0.251800 0.250399 0.276570 0.267894 0.242280 0.241777 0.212482 0.234162 0.202398 0.379116 0.206859 0.223858 0.218767 0.204958 0.229844 0.216196
chargesum: 0.00000
title: Mulliken charges with hydrogens summed into heavy atoms:
elementType: Cl O O C C C C C C C C C C C C C C
charge: -0.076679 -0.023456 -0.247627 0.005467 -0.006835 -0.006884 0.524834 0.155694 -0.160419 -0.207192 0.591696 -0.343034 -0.137028 -0.139613 0.181913 -0.048215 -0.062622
polarizability: 2.11875079e+02 6.38280145e+00 1.54375410e+02 -1.01088470e+01 6.68890025e+00 1.29148109e+02
1716.lowfreq: -7.6067 -5.2673 0.0025 0.0025 0.0025 2.4776 18.6251 41.3012 49.1575
frequency: 18.3938 41.2868 49.1051 49.5275 84.5624 93.2690 125.4622 162.6707 196.8642 211.5922 225.1486 238.8223 260.9399 263.2603 304.4098 331.5479 342.1167 364.7983 380.0271 420.7108 431.9147 453.2223 474.4038 517.1122 569.5775 610.4104 624.0889 651.5224 680.3151 717.6029 739.0474 769.2156 797.1279 822.3222 841.4762 853.2633 869.5824 880.0396 891.3425 923.8453 943.4167 956.0761 960.7442 961.7945 970.1279 1027.2777 1039.6223 1079.0002 1083.1414 1091.4545 1095.3803 1109.0403 1152.7610 1182.4382 1183.1919 1213.2965 1219.4168 1224.0051 1266.4664 1282.4125 1319.7309 1325.5826 1344.2094 1349.5178 1364.3667 1380.7083 1390.2175 1398.6364 1430.8175 1453.8297 1463.7230 1466.2399 1474.3114 1483.7540 1490.4453 1494.5870 1554.7783 1617.2353 1638.2262 2961.7876 2969.7503 2976.8960 2988.5938 3053.5276 3063.7678 3067.0281 3072.6366 3083.4769 3104.8130 3111.9307 3128.8990 3151.1088 3157.6551 3211.0222 3226.9988 3511.6700
redmass: 5.1174 4.2255 3.4238 10.3639 4.1030 4.2875 5.3238 4.1841 2.5782 3.9680 1.3537 3.9798 1.8048 1.2033 5.1268 4.8531 3.7048 2.8350 2.5999 3.2711 4.2198 3.6599 3.0579 3.4799 5.4756 1.2545 3.6421 4.4848 4.9244 5.1391 4.0682 3.2605 1.2814 2.0508 1.5456 4.1789 2.5616 1.5956 1.5322 1.2025 4.1841 1.9922 1.3518 1.3512 1.4406 3.2133 2.3997 1.6899 1.2623 1.5016 1.3653 2.0510 1.3855 1.8490 1.3543 1.9108 2.6010 1.3062 1.5345 1.3149 3.2152 1.6150 2.4972 1.6423 3.2826 1.2307 3.9705 1.2163 1.0858 1.2702 1.0609 1.0754 1.0570 1.0527 1.0651 3.1986 7.1882 7.1770 7.9431 1.0800 1.0366 1.0362 1.0649 1.0990 1.0993 1.0997 1.0990 1.0994 1.0501 1.0615 1.0872 1.0960 1.0933 1.1182 1.1165 1.0639
irintensity: 0.0622 0.1167 0.0901 2.5001 0.4456 0.2032 0.4061 0.0461 0.3728 0.6015 0.1787 0.1575 0.3667 0.1924 0.2212 1.8367 5.2104 1.4848 2.7420 4.1521 12.7074 15.1528 5.0070 9.6389 5.5226 105.9936 36.8232 6.3551 11.9588 36.4428 11.7600 0.7006 0.9390 2.5222 7.8258 3.8038 25.8316 5.8627 10.3462 0.8267 15.1418 0.3847 1.0176 0.0271 0.4348 35.2751 202.6351 9.1817 99.1960 3.1584 13.3284 18.4807 2.0294 5.6436 0.6595 9.3361 7.9771 0.3406 20.9857 4.8205 67.9110 0.0906 56.4158 2.4331 13.6061 22.7054 16.5718 15.6185 12.5318 21.0956 7.9653 2.3060 1.5656 23.9315 15.9873 23.2652 20.3313 16.3639 237.3845 26.5012 28.4433 30.1143 43.9674 7.8013 33.5167 11.1606 111.7201 33.2149 8.3936 3.6907 9.3986 14.3454 1.7821 0.0215 9.1094 30.9968
temp: 298.150 k
press: 1.00000 atm
elementType: 17 8 8 6 6 6 6 6 6 6 6 6 6 6 6 6 6 1 1 1 1 1 1 1 1 1 1 1 1 1 1 1 1 1
symmnumber: 1
zpe: 721381.0 jmol-1
zpe.correction: 0.274760 hartree
zpe.thermalcorrener: 0.292236 hartree
zpe.thermalcorrenthalpy: 0.293181 hartree
zpe.thermalcorrgfe: 0.227855 hartree
zpe.sumelectzpe: -1152.911998 hartree
zpe.sumelectthermal: -1152.894521 hartree
zpe.sumelectthermalent: -1152.893577 hartree
zpe.sumelectthermalfe: -1152.958903 hartree
dipole: 1.0981 -1.8608 -0.2349
dipole: 2.1734
quadrupole: -114.8844 -107.1322 -103.2386
quadrupole: -3.7979 0.1358 0.7219
quadrupole: -6.4660 1.2862 5.1797 -3.7979 0.1358 0.7219
hfenergy: -1153.1867576 hartree
pointgroup: C01 [X(C14H17Cl1O2)]
dipole: -0.4633019 0.7186661 0.0040135 debye
polarizability: 211.0090633|7.3244396|156.2566185|12.2469977|-2.3577936|128.132916 unknown
InChI: InChI=1S/C14H17ClO2/c1-9(2)7-10-3-4-11(8-12(10)15)14(5-6-14)13(16)17/h3-4,8-9,16H,5-7H2,1-2H3
charge 0 multiplicity 1
34 atoms
Cl -1.753914 -2.772195 -0.278418
O  3.060404 -0.041301 -1.798067
O  4.830832 0.144901 -0.310743
C  2.53727 0.210242 0.548083
C  2.968477 -0.40147 1.911148
C  2.951955 1.106821 1.750295
C  1.088872 0.154721 0.13514
C  3.592008 0.107596 -0.512822
C  0.394383 -1.077085 0.127984
C  0.401193 1.320086 -0.281973
C  -1.680756 0.02876 -0.681357
C  -0.953732 -1.116906 -0.273811
C  -0.946782 1.249087 -0.682999
C  -3.139343 0.004249 -1.109164
C  -4.175845 0.436928 -0.013422
C  -4.120027 -0.462707 1.242902
C  -4.050773 1.928893 0.376265
H  3.942187 -0.897162 1.937673
H  2.174679 -0.869106 2.500169
H  2.145286 1.67059 2.226984
H  3.914131 1.619153 1.668782
H  0.905111 -1.997675 0.426505
H  0.928247 2.280531 -0.299362
H  -1.459204 2.156783 -1.020848
H  -3.264692 0.680524 -1.977664
H  -3.405181 -1.013792 -1.44685
H  -5.170876 0.298083 -0.487499
H  3.813193 -0.109118 -2.446612
H  -4.913343 -0.176238 1.958373
H  -4.254141 -1.528134 0.985016
H  -3.146898 -0.361485 1.758679
H  -4.105116 2.588249 -0.511153
H  -3.095108 2.127918 0.895166
H  -4.869196 2.216461 1.062301
