program: Gaussian 09
title: 000033606
version: EM64L-G09RevD.01
frameworkgroup: C1[X(C10H16O2)]
method: RPBEPBE
basis: SDD
operation: Freq
keyword: #pfreq=noraman
keyword: PBEPBE/SDD
title: #p freq=noraman PBEPBE/SDD
converged: YES YES NO NO
title: Mulliken charges:
elementType: O O C C C C C C C C C C H H H H H H H H H H H H H H H H
charge: -0.432549 -0.273931 0.313141 -0.286020 -0.335767 -0.743025 -0.731603 -0.250065 0.195645 0.340356 -0.792017 -0.793146 0.231319 0.263982 0.262006 0.213207 0.209644 0.221753 0.212765 0.221934 0.244064 0.373291 0.216000 0.214236 0.236429 0.221457 0.222322 0.224573
chargesum: 0.00000
title: Mulliken charges with hydrogens summed into heavy atoms:
elementType: O O C C C C C C C C C C
charge: -0.059258 -0.273931 0.313141 -0.054701 -0.071785 -0.058167 -0.075150 -0.006000 0.195645 0.340356 -0.125352 -0.124795
polarizability: 1.49909310e+02 -1.87092372e-01 1.12618683e+02 4.39002186e-01 -2.29497648e+00 9.75673234e+01
1716.lowfreq: -4.0757 -2.2652 0.0006 0.0007 0.0008 8.4955 28.7384 63.1280 85.1109
frequency: 28.0103 63.0670 85.0620 100.4120 115.8773 150.0940 160.9004 177.5376 187.0340 218.8644 250.3799 281.6116 307.5087 343.1348 363.1416 421.0055 424.9059 466.7445 495.5159 501.7453 589.6263 621.3530 648.9092 743.5078 794.5820 831.1894 837.4891 878.7663 930.0298 948.8856 959.9856 966.5375 994.9011 999.2983 1024.5066 1044.9218 1056.7183 1079.5802 1089.6931 1127.8029 1168.3638 1192.3764 1235.5956 1253.7978 1314.5184 1329.6916 1383.2353 1389.0741 1390.1380 1399.1493 1402.9250 1415.8419 1454.4759 1462.1616 1466.2048 1468.1341 1470.2253 1476.1513 1482.2015 1493.2062 1642.9172 1685.5483 2955.6753 2963.7658 2969.9353 2982.2753 3025.2117 3030.8986 3062.3062 3066.1247 3070.6426 3082.6327 3091.5426 3108.5232 3109.0349 3130.8579 3150.7972 3510.6432
redmass: 3.1822 3.7378 2.1504 1.4537 2.8366 2.8766 1.3480 1.0973 2.2344 1.1764 3.5219 2.7168 3.5901 3.3299 2.6055 2.6171 2.9196 2.9864 2.5737 3.0776 1.8882 2.1198 2.9963 5.6687 3.7896 3.3022 3.0896 1.4691 2.5078 1.4083 1.2921 1.7381 1.3499 1.3552 2.3120 1.5545 1.4106 1.6651 1.4727 1.7961 2.4535 1.8669 1.8561 1.9554 1.8838 2.0931 1.5725 1.2669 1.3398 1.2240 1.3442 1.9239 1.0502 1.0556 1.0490 1.0555 1.0448 1.0866 1.1197 1.0699 7.4874 6.2674 1.0378 1.0387 1.0353 1.0380 1.0968 1.0963 1.0994 1.0987 1.0997 1.0978 1.0959 1.0891 1.0963 1.0884 1.0900 1.0638
irintensity: 0.1400 1.3228 1.6131 0.7261 0.4447 0.2462 0.3307 0.3340 1.1490 0.0325 0.6338 0.5413 4.4309 1.6467 5.7037 12.0159 15.2256 6.9762 10.6255 6.1940 76.9665 65.3197 16.4195 16.6162 4.1811 2.1106 4.0200 23.1382 6.7030 0.7375 2.5882 13.5740 17.5945 7.5268 262.5105 54.6642 80.6094 3.9825 110.4393 31.0213 3.1067 1.0508 2.4713 3.2413 1.3558 16.5371 40.2683 43.6095 34.7761 10.7324 30.7220 66.3585 0.2893 7.7556 15.1301 1.6234 27.9797 5.3489 18.8898 6.7559 175.3744 9.9364 42.7940 63.3491 34.7902 43.0107 13.1046 41.4292 1.2228 56.5127 35.2458 25.3764 31.8064 11.5203 4.2296 14.4219 7.8380 28.3445
temp: 298.150 k
press: 1.00000 atm
elementType: 8 8 6 6 6 6 6 6 6 6 6 6 1 1 1 1 1 1 1 1 1 1 1 1 1 1 1 1
symmnumber: 1
zpe: 619651.5 jmol-1
zpe.correction: 0.236013 hartree
zpe.thermalcorrener: 0.250470 hartree
zpe.thermalcorrenthalpy: 0.251414 hartree
zpe.thermalcorrgfe: 0.194599 hartree
zpe.sumelectzpe: -540.138006 hartree
zpe.sumelectthermal: -540.123549 hartree
zpe.sumelectthermalent: -540.122605 hartree
zpe.sumelectthermalfe: -540.179420 hartree
dipole: 0.5231 1.4745 -0.9535
dipole: 1.8322
quadrupole: -68.3643 -69.8845 -75.5225
quadrupole: 0.4642 -0.7047 0.9948
quadrupole: 2.8928 1.3726 -4.2654 0.4642 -0.7047 0.9948
hfenergy: -540.3740192 hartree
pointgroup: C01 [X(C10H16O2)]
dipole: 0.2488877 -0.5960932 0.3199521 debye
polarizability: 149.701582|2.7221506|113.1086331|-0.6976197|-0.9565185|97.2851011 unknown
InChI: InChI=1S/C10H16O2/c1-6(2)5-7-8(9(11)12)10(7,3)4/h5,7-8,11H,1-4H3
charge 0 multiplicity 1
28 atoms
O  -2.606003 1.622431 1.29676
O  -1.412292 1.823267 -0.681916
C  -0.887387 -1.314719 -0.345861
C  0.272986 -0.647405 0.409478
C  -1.219548 -0.210184 0.705526
C  -1.093234 -1.049499 -1.8349
C  -1.261301 -2.734812 0.082959
C  1.242794 0.277141 -0.232255
C  -1.704384 1.132063 0.328225
C  2.578804 0.364658 0.044322
C  3.451989 1.36368 -0.697389
C  3.319099 -0.477747 1.068845
H  0.679031 -1.251051 1.229652
H  -1.634491 -0.559953 1.654647
H  -0.955139 0.009802 -2.100505
H  -0.379469 -1.655383 -2.423851
H  -2.117179 -1.340716 -2.135798
H  -0.659887 -3.474704 -0.478443
H  -1.08222 -2.90022 1.161184
H  -2.329377 -2.938866 -0.120323
H  0.829294 0.95315 -0.99113
H  -2.902562 2.530198 1.013785
H  3.9358 2.068336 0.008789
H  4.270604 0.852389 -1.24306
H  2.87086 1.955145 -1.425442
H  4.130799 -1.055031 0.582623
H  3.804624 0.170296 1.825533
H  2.672487 -1.193267 1.601944
