program: Gaussian 09
title: 000033562
version: EM64L-G09RevD.01
frameworkgroup: C1[X(C7H10Br2)]
method: RPBEPBE
basis: SDD
operation: Freq
keyword: #pfreq=noraman
keyword: PBEPBE/SDD
title: #p freq=noraman PBEPBE/SDD
converged: NO NO NO NO
title: Mulliken charges:
elementType: Br Br C C C C C C C H H H H H H H H H H
charge: 0.047460 0.047460 -0.055513 -0.055517 -0.534359 -0.487646 -0.487655 -0.487652 -0.487648 0.270029 0.270028 0.274826 0.215423 0.215422 0.274834 0.215421 0.274834 0.274826 0.215424
chargesum: 0.00000
title: Mulliken charges with hydrogens summed into heavy atoms:
elementType: Br Br C C C C C C C
charge: 0.047460 0.047460 0.214516 0.214511 -0.534359 0.002604 0.002601 0.002604 0.002603
polarizability: 1.18883579e+02 -1.68155729e-03 1.10019081e+02 -4.14814187e-03 1.59339387e-03 7.61824297e+01
1716.lowfreq: -6.2859 0.0004 0.0005 0.0006 15.4220 20.9181 121.7902 165.9687 167.3240
frequency: 121.6951 165.9687 167.3226 216.3975 258.8938 264.5153 285.5936 402.5112 437.1454 575.9593 714.0835 740.1614 767.1753 807.2819 812.3068 843.5619 873.3590 885.8136 942.9970 943.8183 1004.4407 1005.1447 1023.9120 1038.3130 1105.4511 1113.1378 1137.0382 1176.6830 1184.0490 1204.6402 1236.8548 1247.6991 1249.2914 1282.1604 1304.0386 1305.5214 1312.9649 1460.3171 1472.8408 1478.2817 1494.6966 3014.8960 3015.4909 3026.4482 3028.1340 3070.3408 3073.3778 3089.9101 3095.3542 3097.8575 3105.9631
redmass: 4.5844 25.0544 6.3487 1.8458 3.5171 8.5857 5.0352 1.7741 2.5291 4.0930 4.1373 4.0893 3.7286 1.3378 2.2660 2.4231 1.7206 2.9509 4.3409 1.6741 1.5949 2.6255 2.1091 3.0353 2.3727 1.0886 1.0965 1.5977 1.3211 1.1653 1.7746 1.2610 1.4821 1.3187 1.3757 1.4482 1.4942 1.0747 1.0873 1.0778 1.0921 1.0591 1.0589 1.0619 1.0618 1.1055 1.1046 1.1055 1.1037 1.0889 1.0933
irintensity: 0.0000 0.0034 0.1782 0.0000 0.0023 4.9058 13.4332 0.5323 1.1576 0.0000 1.3950 139.4810 6.2872 9.9133 27.5719 4.5853 7.4214 8.6266 6.0046 0.0000 0.0001 7.5548 2.5888 3.6813 0.4113 0.3360 19.3968 4.5086 1.7412 0.0000 0.0000 0.2206 0.0111 0.0000 13.4937 8.3648 4.1726 0.0000 15.2400 10.6859 11.6756 0.0001 52.9542 42.8937 46.3118 0.0000 0.9572 28.9999 46.9785 35.6868 4.2337
temp: 298.150 k
press: 1.00000 atm
elementType: 35 35 6 6 6 6 6 6 6 1 1 1 1 1 1 1 1 1 1
symmnumber: 1
zpe: 404827.1 jmol-1
zpe.correction: 0.154191 hartree
zpe.thermalcorrener: 0.162704 hartree
zpe.thermalcorrenthalpy: 0.163649 hartree
zpe.thermalcorrgfe: 0.119253 hartree
zpe.sumelectzpe: -298.953583 hartree
zpe.sumelectthermal: -298.945069 hartree
zpe.sumelectthermalent: -298.944125 hartree
zpe.sumelectthermalfe: -298.988521 hartree
dipole: 0.0007 3.3429 0.0002
dipole: 3.3429
quadrupole: -73.6366 -71.0129 -71.8984
quadrupole: 0.0005 0.0001 0.0000
quadrupole: -1.4540 1.1697 0.2842 0.0005 0.0001 0.0000
hfenergy: -299.1077738 hartree
pointgroup: C01 [X(C7H10Br2)]
dipole: -1.315202 0.0000085 -0.0000613 debye
dipolederiv: -0.3263077 -0.290718 0.0000174 -0.2904225 -0.6129999 0.0000331 0.0000193 0.0000345 -0.1140459 -0.3263005 0.2907154 -0.0000371 0.2904206 -0.6130062 0.0000599 -0.0000395 0.0000624 -0.1140476 -0.0347148 -0.000002 -0.0800423 0.0000212 -0.1980784 0.0000265 0.1556157 0.0000208 0.0824185 -0.0347198 -0.0000051 0.0800321 -0.0000264 -0.1980832 0.0000226 -0.1556249 0.0000264 0.0824104 0.7890288 0.0000044 0.0000291 0.0000035 1.4173483 -0.0001287 0.0000237 -0.0001321 0.1296428 0.038173 -0.1030026 -0.0093613 -0.0014083 0.0531727 0.0701952 0.000094 0.0080218 -0.0102202 0.0381661 0.1030042 -0.0093784 0.0014088 0.0531619 -0.0702021 0.0000844 -0.0080231 -0.0102085 0.0381652 -0.1030037 0.0093811 -0.0014059 0.0531625 -0.0701989 -0.0000817 -0.0080347 -0.010201 0.0381711 0.1030044 0.0093671 0.0014026 0.0531725 0.0701951 -0.0000856 0.0080274 -0.0102231 0.0466753 0.0000043 0.0898957 0.0000009 0.0512342 -0.0000087 0.051365 -0.0000107 -0.0936195 0.0466886 -0.0000047 -0.0898815 -0.0000009 0.0512342 -0.0000046 -0.0513509 -0.0000092 -0.093633 0.068504 0.0886383 0.0508279 0.03915 -0.0909354 -0.077743 0.0170663 -0.0482265 0.0243379 -0.1467538 -0.02668 -0.1092485 0.0126653 0.0633467 0.0171766 -0.0628772 0.0049464 0.016099 -0.146758 0.0266664 -0.1092563 -0.012673 0.063342 -0.0171811 -0.0628767 -0.0049516 0.0161002 0.0685037 -0.0886299 0.0508391 -0.0391487 -0.090913 0.077754 0.0170724 0.0482385 0.0243198 -0.1467736 -0.0266612 0.10924 0.0126806 0.0633418 -0.0171829 0.0628626 -0.0049553 0.0161126 0.0685124 0.0886231 -0.0508347 0.0391398 -0.0909126 0.0777587 -0.0170679 0.0482501 0.0243096 0.0685084 -0.0886348 -0.0508223 -0.0391428 -0.0909345 -0.0777458 -0.0170612 -0.0482328 0.0243329 -0.1467685 0.0266815 0.1092327 -0.012665 0.0633465 0.017174 0.0628621 0.0049478 0.0161152 unknown
polarizability: 110.019081|0.0001095|118.8835794|0.0015926|-0.0041485|76.1824297 unknown
InChI: InChI=1S/C7H10Br2/c8-7(9)5-1-2-6(7)4-3-5/h5-6H,1-4H2
charge 0 multiplicity 1
19 atoms
Br 2.016339 1.622494 -0.000062
Br 2.01632 -1.622511 0.000246
C  -0.250505 -0.000084 -1.155139
C  -0.25061 0.000092 1.155105
C  0.793355 -0.000001 0.000033
C  -1.099739 -1.259742 -0.789824
C  -1.099708 1.259652 -0.790002
C  -1.0998 -1.259641 0.789881
C  -1.099799 1.25976 0.789712
H  0.167669 -0.000149 -2.172067
H  0.167462 0.000146 2.172075
H  -0.64317 -2.182152 -1.186081
H  -2.115074 -1.173424 -1.214418
H  -2.11504 1.173276 -1.214587
H  -0.643131 2.182004 -1.186383
H  -2.115166 -1.173242 1.214382
H  -0.643274 -2.181994 1.186318
H  -0.643256 2.182168 1.186004
H  -2.115174 1.173448 1.214208
