program: Gaussian 09
title: 000033537
version: EM64L-G09RevD.01
frameworkgroup: C1[X(C8H12O5)]
method: RPBEPBE
basis: SDD
operation: Freq
keyword: #pfreq=noraman
keyword: PBEPBE/SDD
title: #p freq=noraman PBEPBE/SDD
converged: NO YES NO NO
title: Mulliken charges:
elementType: O O O O O C C C C C C C C H H H H H H H H H H H H
charge: -0.218385 -0.446008 -0.195531 -0.405315 -0.212116 0.166482 0.231458 -0.235221 -0.742689 0.202600 -0.704360 -0.754022 0.146266 0.293284 0.248336 0.236998 0.218319 0.224388 0.269611 0.234284 0.212968 0.263015 0.231584 0.349161 0.384892
chargesum: 0.00000
title: Mulliken charges with hydrogens summed into heavy atoms:
elementType: O O O O O C C C C C C C C
charge: -0.218385 -0.096847 -0.195531 -0.020423 -0.212116 0.166482 0.231458 0.058063 -0.039035 0.202600 0.023923 -0.046455 0.146266
polarizability: 1.16191883e+02 6.22887973e+00 9.21295171e+01 3.47748561e+00 1.29736154e+00 8.72893403e+01
1716.lowfreq: -17.3609 -2.5925 -0.0004 0.0006 0.0009 11.7387 46.6848 74.6125 85.1084
frequency: 46.6132 74.6079 85.0697 151.8460 170.2684 208.2507 220.2004 223.8064 245.7587 251.9900 265.8037 280.0826 310.2855 334.9436 353.5632 361.8222 394.4087 475.7470 505.5006 552.3026 580.8546 612.8955 623.1220 631.6512 705.0755 735.8283 786.4327 811.3033 871.3748 891.3846 903.6966 1002.7910 1006.6975 1032.7588 1055.7450 1086.6300 1109.1452 1123.1232 1125.7233 1168.9132 1184.2994 1208.1211 1272.6103 1291.2481 1306.1530 1318.5741 1389.1989 1395.1684 1400.0588 1461.2385 1465.3075 1466.4711 1470.8368 1476.4774 1487.3833 1649.5023 1718.2341 2983.6113 2990.4242 3005.5519 3021.2750 3071.6056 3085.5615 3095.6796 3098.2746 3117.4999 3145.1906 3508.4600 3572.6218
redmass: 8.8117 3.9991 6.7766 3.0827 1.2222 1.1768 2.6192 1.4125 1.3608 1.6700 2.5187 3.8280 3.0921 3.5345 5.0913 5.1497 4.6164 4.8692 3.9057 4.3764 3.4515 4.5115 4.3659 1.6094 3.2231 4.5702 3.3398 3.0879 2.2086 3.5995 2.4981 1.8979 1.9859 2.2091 1.5819 1.9127 3.1566 2.4060 2.2444 1.9867 2.7344 3.7227 1.5664 2.1060 2.1360 1.9180 1.2075 1.2092 1.2069 1.0564 1.0514 1.0472 1.0568 1.0483 1.0509 9.6246 12.5127 1.0370 1.0365 1.0817 1.0363 1.0978 1.1005 1.1004 1.0981 1.0998 1.1005 1.0640 1.0659
irintensity: 1.6021 2.1549 0.0440 4.9719 8.9842 9.8995 10.1586 85.7118 1.8839 10.3017 13.7013 3.4150 3.3298 2.2190 5.5321 10.8328 2.1696 5.9289 11.4648 15.5365 30.1813 47.7213 21.7772 71.4706 38.3054 19.2317 10.8213 9.7072 10.8827 49.4974 38.7495 151.7053 93.0443 192.3300 98.6508 19.7018 17.9766 46.3697 15.4872 9.4891 60.7398 2.3409 11.7495 13.4841 40.8363 9.5701 23.3717 26.8767 14.6174 9.8410 20.2039 15.2507 13.6176 8.7713 10.5918 161.6407 311.3755 13.7442 25.2178 0.7005 8.2950 23.8933 20.5439 11.7342 12.8536 13.7140 5.7121 33.5088 8.2143
temp: 298.150 k
press: 1.00000 atm
elementType: 8 8 8 8 8 6 6 6 6 6 6 6 6 1 1 1 1 1 1 1 1 1 1 1 1
symmnumber: 1
zpe: 508620.2 jmol-1
zpe.correction: 0.193723 hartree
zpe.thermalcorrener: 0.207681 hartree
zpe.thermalcorrenthalpy: 0.208625 hartree
zpe.thermalcorrgfe: 0.154120 hartree
zpe.sumelectzpe: -687.162469 hartree
zpe.sumelectthermal: -687.148511 hartree
zpe.sumelectthermalent: -687.147567 hartree
zpe.sumelectthermalfe: -687.202072 hartree
dipole: 2.3169 5.5401 -2.4351
dipole: 6.4800
quadrupole: -70.2430 -82.4085 -78.4641
quadrupole: -10.2692 0.5542 -1.3296
quadrupole: 6.7955 -5.3700 -1.4256 -10.2692 0.5542 -1.3296
hfenergy: -687.356192 hartree
pointgroup: C01 [X(C8H12O5)]
dipole: 0.9364271 2.1659037 -0.9651541 debye
dipolederiv: -1.268873 -0.3302344 -0.2099611 -0.1014926 -0.4800411 0.05686 -0.4290382 -0.0665432 -0.448607 -0.5341308 -0.0630263 0.2133337 -0.0577414 -0.5640643 -0.2484099 0.1717167 -0.2288806 -0.5091867 -0.9211646 -0.3583288 -0.0417433 -0.4326519 -0.7654911 0.0801691 0.0100964 0.149268 -0.3753321 -1.2329944 -0.2284668 -0.1431953 -0.2077131 -0.3913918 0.0311897 0.0022896 0.0629013 -0.2645191 -0.6622681 0.013928 0.0788564 -0.1177324 -0.5224241 -0.2614658 -0.1126898 -0.3137921 -0.6652491 0.3899973 0.0122537 -0.2112524 -0.0724669 0.512915 0.1325395 -0.0736178 0.1567165 0.3460529 0.3568929 0.1558998 0.1171732 0.3751787 0.3408814 -0.029517 0.0004488 -0.0232276 0.2734279 -0.0911634 -0.0998943 -0.0613325 0.0111922 -0.259443 0.171926 -0.0316453 0.176847 -0.1065565 -0.0168859 -0.0245858 0.0548223 -0.085214 -0.0961182 0.0892451 0.0546632 0.0202057 -0.0719198 1.6626859 0.6130519 0.2432585 0.3066034 0.9195852 -0.287463 0.4720256 -0.2344346 0.5388448 -0.0822036 -0.0187845 -0.0303174 -0.0431603 -0.0056361 -0.01858 -0.0435651 -0.066089 -0.0896962 -0.039218 -0.0288433 -0.0002466 -0.0569886 0.0354 -0.0316145 -0.0614123 -0.0307015 0.0748269 1.5119236 0.1611788 -0.0218605 0.2296035 0.5115326 0.3564082 -0.0633859 0.4492749 0.6666312 0.076731 0.0175089 0.0557355 0.0134594 0.0496455 -0.0299767 0.0529659 -0.0330484 0.0077034 -0.0252674 -0.1076654 -0.0425989 -0.073121 0.0451107 -0.0196161 -0.0722301 -0.0538132 0.0492608 0.0531754 0.0194329 0.0667624 0.0364016 0.0438337 -0.1006312 0.0756428 -0.0741526 -0.0371705 -0.0279989 0.1445313 -0.0531323 0.0906101 -0.0178012 0.0607696 -0.0194897 0.0519248 0.0628559 0.0295315 -0.0929377 0.009101 -0.1111431 -0.0133816 0.0296568 0.0174093 0.0473427 0.0778932 0.0524453 0.012997 0.0931356 0.0244249 0.1093662 -0.0439045 0.0748087 -0.0463572 0.0201569 0.036872 0.0812446 -0.0659199 0.0962207 -0.0262825 0.0605445 -0.057605 0.0325483 0.0652236 0.0766367 -0.0088863 0.026581 0.0486988 -0.074632 0.131241 0.0096133 0.1191662 0.0025208 0.0035225 -0.0486773 -0.0560031 -0.100733 0.0294003 -0.0678602 -0.0427201 -0.0460465 0.0833829 0.0695539 0.034668 0.0188408 0.0571604 0.0570933 -0.0423795 0.0944451 -0.0704017 -0.0714422 0.2359777 0.1512042 -0.0680063 0.1389638 0.2512395 0.1001958 -0.1068028 0.142995 0.2038259 0.3462223 -0.007568 0.0279692 0.031641 0.3107038 -0.1193271 0.0780766 -0.1217023 0.1670721 unknown
polarizability: 116.23482|6.0489871|92.0480871|3.6717755|1.284911|87.3278336 unknown
InChI: InChI=1S/C8H12O5/c1-4-5(9)13-8(3,6(10)11)7(4,2)12/h4,10,12H,1-3H3
charge 0 multiplicity 1
25 atoms
O  -0.114837 -1.177146 0.907652
O  -0.732294 1.781121 1.106461
O  -2.235106 -1.926881 0.340765
O  3.024653 -0.081288 -0.392098
O  1.37304 -1.260608 -1.509686
C  -0.20628 1.053469 -0.060711
C  0.776205 -0.025771 0.561094
C  -1.319648 0.162511 -0.693766
C  0.454461 2.040994 -1.036083
C  -1.339757 -1.084509 0.200881
C  1.497093 0.404889 1.835054
C  -2.71017 0.801214 -0.83968
C  1.717631 -0.541328 -0.548512
H  -0.964941 -0.180903 -1.685629
H  1.257475 2.604536 -0.530024
H  0.876481 1.535382 -1.922423
H  -0.295506 2.76812 -1.400881
H  2.168488 1.254864 1.635528
H  0.751113 0.703402 2.584822
H  2.100049 -0.431059 2.22633
H  -2.688957 1.665188 -1.528923
H  -3.414103 0.056725 -1.248213
H  -3.111714 1.122673 0.137325
H  -1.355265 2.48111 0.787192
H  3.585991 -0.431705 -1.136477
