program: Gaussian 09
title: 000033747
version: EM64L-G09RevD.01
frameworkgroup: C1[X(C19H24O3)]
method: RPBEPBE
basis: SDD
operation: Freq
keyword: #pfreq=noraman
keyword: PBEPBE/SDD
title: #p freq=noraman PBEPBE/SDD
converged: YES YES NO NO
title: Mulliken charges:
elementType: O O O C C C C C C C C C C C C C C C C C C C H H H H H H H H H H H H H H H H H H H H H H H H
charge: -0.262059 -0.289843 -0.252979 0.310347 -0.261632 -0.391531 -0.737897 -0.749531 -0.272706 0.291233 0.365925 -0.792580 -0.794163 -0.492381 0.289863 0.180404 -0.481547 0.360654 -0.776076 -0.635864 0.241129 -0.502362 0.258563 0.264328 0.221946 0.220813 0.213189 0.262994 0.211285 0.207390 0.199036 0.216720 0.218801 0.227177 0.225415 0.217563 0.236387 0.217894 0.241865 0.293054 0.232949 0.251031 0.242631 0.248321 0.250214 0.274030
chargesum: 0.00000
title: Mulliken charges with hydrogens summed into heavy atoms:
elementType: O O O C C C C C C C C C C C C C C C C C C C
charge: -0.262059 -0.289843 -0.252979 0.310347 -0.003069 -0.127203 -0.081949 -0.067861 -0.073671 0.291233 0.365925 -0.129882 -0.114799 -0.032622 0.289863 0.180404 -0.188493 0.360654 -0.049464 -0.137329 0.241129 -0.228332
polarizability: 2.23380442e+02 -3.24213450e+00 2.53227484e+02 -4.90359597e+00 1.04460772e+00 1.76881626e+02
1716.lowfreq: -10.1788 -7.3810 -6.7345 -0.0007 -0.0003 -0.0003 3.0799 14.2213 18.4005
frequency: -8.4535 13.4905 18.3256 29.3386 31.7177 54.9331 76.3027 84.1587 87.0020 98.7614 113.1659 130.3609 146.3499 166.3933 176.1762 184.4209 196.9665 203.9439 225.6553 231.7800 247.9215 261.0871 275.7219 289.1618 309.7579 331.6816 338.2566 357.8636 366.0521 407.1997 416.8537 442.5149 455.6323 489.6060 505.8327 515.4276 591.1896 617.0189 621.1157 637.2681 648.7824 655.9745 683.2756 716.1592 733.2715 791.6218 807.2666 819.8907 832.6985 855.5930 860.9116 871.4239 877.8563 924.5211 939.0632 945.8197 950.3431 957.7969 969.7635 975.0839 980.4396 989.6685 1011.5721 1035.1006 1044.7411 1053.4427 1075.2331 1082.2465 1116.0981 1125.0846 1128.1603 1147.6867 1165.7356 1171.4926 1195.4754 1206.2049 1242.1936 1257.0091 1274.0267 1287.0485 1308.0821 1323.0192 1343.4860 1367.2014 1386.2578 1389.7018 1396.2436 1398.7671 1402.4705 1411.5826 1417.9203 1441.0310 1454.4020 1454.8856 1455.2298 1461.8862 1465.7936 1471.0725 1472.0683 1473.2925 1475.9248 1483.2882 1491.4968 1585.3803 1607.9381 1629.8914 1683.7250 2145.3871 2956.4350 2965.5950 2973.7182 2977.8795 2980.4858 2983.5539 3027.2470 3032.9374 3037.4339 3043.1748 3057.5420 3060.2761 3066.0080 3077.2083 3080.7137 3092.4578 3096.9330 3098.6275 3099.9954 3110.5770 3120.5261 3152.7394 3231.0286 3428.6561
redmass: 3.5692 4.3951 3.6738 4.2031 3.5190 4.1171 4.3735 3.5726 1.1084 3.5199 1.0610 2.7924 2.8643 2.8139 1.2504 1.3646 2.9154 3.2775 2.0985 2.0125 2.7404 3.7198 2.5739 4.3688 2.7328 2.6985 2.8982 4.2358 2.6448 3.3565 2.4870 2.9387 2.7576 3.5432 3.4939 3.3677 4.6596 4.5879 4.3412 1.2342 1.4135 3.6044 5.1887 4.4456 5.3286 4.3879 3.8828 3.0657 4.3845 1.8811 1.7172 2.0864 2.9347 3.5263 2.3328 2.7172 1.3949 1.4780 2.1669 1.9546 1.6693 1.2525 1.5712 1.7225 1.4635 1.6436 1.3925 1.5778 2.1611 2.3224 2.5863 1.2603 2.6136 1.9051 2.0898 2.5698 2.4135 1.6304 1.6405 1.7755 1.4952 1.6732 1.3178 1.6916 1.2411 1.2816 1.6709 1.2717 1.2511 2.2814 2.2526 1.0814 1.0591 1.0507 1.1313 1.0546 1.0514 1.0856 1.0546 1.0466 1.0809 1.1453 1.0617 8.1760 8.8414 7.2207 6.3576 6.0058 1.0372 1.0392 1.0368 1.0363 1.0622 1.0375 1.0968 1.0964 1.0592 1.0962 1.0990 1.0983 1.0989 1.0982 1.0981 1.0886 1.0984 1.0959 1.0978 1.1060 1.0874 1.0892 1.0994 1.1595
irintensity: 0.1093 0.1539 0.0146 0.2128 0.3413 0.3274 0.8178 1.8818 0.0299 0.5412 0.2928 0.3382 0.8796 0.0207 1.6011 0.1095 6.3375 4.1040 0.4355 4.4840 0.7012 3.2206 1.0982 6.1056 6.0529 5.5015 13.4082 1.4692 1.3362 2.9313 1.1458 2.7720 4.9615 8.1447 6.7539 0.7466 2.6126 6.3359 7.8544 71.0972 59.6273 12.0199 11.5840 5.3558 11.5601 33.8347 58.7095 0.7887 62.3178 11.6362 8.4369 15.9713 51.0640 7.7481 23.7050 2.8368 1.5635 0.9377 17.2891 12.1847 71.2907 1.7878 20.1440 38.0445 5.0605 51.2238 4.9063 3.5776 354.3787 10.9623 8.8008 23.2342 49.2948 5.6836 45.4624 29.0735 36.0481 13.7911 0.7759 39.0586 8.5260 12.5847 11.8635 80.4474 19.1165 33.1239 12.2177 13.9675 19.7388 11.8259 69.9848 15.8139 26.4205 1.6079 11.3695 14.5228 7.8553 16.0127 8.8662 24.9477 2.2407 13.3790 11.4239 27.3233 146.0795 11.9379 6.2601 5.4636 47.1025 52.8350 31.5942 56.1732 16.6946 29.0436 12.8685 39.7677 37.1612 4.8975 15.6990 14.1209 44.9593 22.4069 31.7054 26.7665 8.5187 27.1009 14.3261 8.2723 12.1606 4.1659 3.0462 58.6197
temp: 298.150 k
press: 1.00000 atm
elementType: 8 8 8 6 6 6 6 6 6 6 6 6 6 6 6 6 6 6 6 6 6 6 1 1 1 1 1 1 1 1 1 1 1 1 1 1 1 1 1 1 1 1 1 1 1 1
symmnumber: 1
zpe: 988721.7 jmol-1
zpe.correction: 0.376584 hartree
zpe.thermalcorrener: 0.401039 hartree
zpe.thermalcorrenthalpy: 0.401983 hartree
zpe.thermalcorrgfe: 0.319916 hartree
zpe.sumelectzpe: -962.326632 hartree
zpe.sumelectthermal: -962.302177 hartree
zpe.sumelectthermalent: -962.301233 hartree
zpe.sumelectthermalfe: -962.383301 hartree
dipole: 0.7405 -0.3634 1.0131
dipole: 1.3064
quadrupole: -124.7146 -121.2316 -128.5750
quadrupole: 5.8777 2.8738 -3.1864
quadrupole: 0.1258 3.6088 -3.7346 5.8777 2.8738 -3.1864
hfenergy: -962.7032165 hartree
pointgroup: C01 [X(C19H24O3)]
dipole: 0.192313 0.166887 0.4464755 debye
polarizability: 223.4571126|3.5075018|218.0923354|0.8639701|-38.336225|211.9401043 unknown
InChI: InChI=1S/C19H24O3/c1-7-8-15-10-14(13(4)22-15)11-21-18(20)17-16(9-12(2)3)19(17,5)6/h1,9-10,16-17H,8,11H2,2-6H3
charge 0 multiplicity 1
46 atoms
O  -0.191334 -1.232278 2.007999
O  0.885883 -2.206038 0.173189
O  -3.793705 0.243632 -0.351305
C  3.540949 -1.2003 1.653704
C  3.129183 -0.176561 0.586167
C  2.077724 -0.655043 1.655508
C  4.407991 -0.758597 2.833004
C  3.813692 -2.632874 1.19855
C  3.584975 1.236631 0.56828
C  0.921833 -1.44759 1.179956
C  3.621598 2.06775 -0.516858
C  4.128817 3.494144 -0.382646
C  3.17519 1.683301 -1.916043
C  -1.463838 -1.935943 1.594531
C  -2.247696 -1.14433 0.596365
C  -3.325491 -0.305822 0.861624
C  -2.027109 -1.113078 -0.841918
C  -2.970682 -0.267234 -1.38677
C  -4.049522 0.111995 2.099684
C  -3.284682 0.19357 -2.783789
C  -2.980147 1.620858 -3.034039
C  -2.72814 2.806436 -3.257385
H  2.935192 -0.631325 -0.39225
H  1.835409 0.048285 2.456784
H  4.303733 -1.472922 3.670654
H  5.474059 -0.732075 2.537766
H  4.136631 0.241703 3.212656
H  3.137724 -2.939431 0.383528
H  4.857835 -2.719185 0.842743
H  3.681745 -3.342398 2.037692
H  3.924174 1.648003 1.530268
H  4.997776 3.67216 -1.047709
H  3.348534 4.222255 -0.682401
H  4.436259 3.727671 0.651616
H  2.360257 2.352172 -2.257468
H  4.006374 1.804458 -2.639072
H  2.807236 0.647751 -1.989519
H  -1.998897 -2.051578 2.549774
H  -1.180879 -2.922672 1.189691
H  -1.239682 -1.64837 -1.368412
H  -3.587195 -0.351325 2.986678
H  -4.012462 1.208995 2.230816
H  -5.114817 -0.182767 2.067782
H  -4.354948 0.012554 -3.007928
H  -2.704058 -0.431948 -3.486942
H  -2.510087 3.842661 -3.439753
