program: Gaussian 09
title: 000033521
version: EM64L-G09RevD.01
frameworkgroup: C1[X(C8H11N3)]
method: RPBEPBE
basis: SDD
operation: Freq
keyword: #pfreq=noraman
keyword: PBEPBE/SDD
title: #p freq=noraman PBEPBE/SDD
converged: YES YES NO NO
title: Mulliken charges:
elementType: N N N C C C C C C C C H H H H H H H H H H H
charge: -0.076641 -0.142274 -0.003557 -0.627813 -0.588956 -0.145898 0.252793 -0.309716 -0.452418 -0.163618 -0.352233 0.223412 0.291586 0.224261 0.231623 0.226800 0.231545 0.222662 0.252975 0.242612 0.225902 0.236952
chargesum: 0.00000
title: Mulliken charges with hydrogens summed into heavy atoms:
elementType: N N N C C C C C C C C
charge: -0.076641 -0.142274 -0.003557 0.111446 0.101011 0.076764 0.252793 -0.056741 -0.209806 0.062284 -0.115281
polarizability: 1.99748590e+02 3.44075878e+00 9.71058416e+01 -3.93609016e+00 -5.61019416e+00 5.94268903e+01
1716.lowfreq: -11.4032 -7.6370 -3.0426 -0.0007 -0.0006 0.0007 51.1013 76.9265 84.1180
frequency: 50.8430 76.9107 84.1074 99.4116 129.6193 212.1135 222.4857 272.3793 340.3401 367.6154 412.3077 430.4721 487.9817 538.0747 607.5564 645.2445 716.8399 812.7894 823.7373 874.4884 893.3804 917.1363 950.9626 977.1942 995.3995 1026.5143 1057.3597 1088.1582 1095.4531 1101.1242 1143.6939 1193.1156 1213.5120 1241.6729 1305.7415 1324.5015 1373.0919 1396.2454 1405.0178 1414.5964 1439.5454 1458.9277 1462.0186 1476.2888 1484.7608 1508.0866 1534.0120 1577.3430 1644.2658 2956.2745 2965.0086 2990.5505 3028.0635 3039.8980 3089.3718 3103.3544 3112.5919 3129.4672 3147.3085 3167.0607
redmass: 2.6311 2.8182 2.4579 1.8763 1.1871 2.6863 2.4294 3.8351 3.0541 3.1959 3.2155 3.0157 5.2242 3.9801 7.7701 6.3828 1.9097 1.7746 6.0187 3.3343 1.4991 1.4894 1.4951 1.3639 3.7359 2.8529 1.3744 1.8009 1.2541 1.4660 1.3732 1.4266 2.5748 3.5678 4.3314 1.5804 1.3812 2.2041 2.3420 1.1539 1.2040 1.0559 1.6121 1.2339 1.0470 1.3389 5.2798 6.3330 5.9110 1.0358 1.0361 1.0873 1.1011 1.1014 1.0980 1.0904 1.0979 1.0868 1.0928 1.0999
irintensity: 2.2723 1.7570 0.8962 1.8551 0.0220 1.9099 0.7177 3.4674 16.4910 11.2438 1.4854 4.2802 7.2525 2.2878 2.2602 0.3958 34.2123 51.5621 4.4214 1.0341 5.7170 4.4040 35.0577 0.7896 5.0932 8.4229 6.7204 224.5562 6.2814 10.6885 0.7135 1.2974 7.6665 26.2266 3.3666 3.6695 54.6231 38.0470 12.5715 26.1531 15.8973 8.9664 25.9151 32.5834 25.9189 16.9864 4.3529 185.1566 845.0661 84.0513 133.6689 44.3514 45.9137 32.1154 25.3541 29.4446 1.1050 2.4014 30.4831 22.2145
temp: 298.150 k
press: 1.00000 atm
elementType: 7 7 7 6 6 6 6 6 6 6 6 1 1 1 1 1 1 1 1 1 1 1
symmnumber: 1
zpe: 470332.1 jmol-1
zpe.correction: 0.179140 hartree
zpe.thermalcorrener: 0.190149 hartree
zpe.thermalcorrenthalpy: 0.191093 hartree
zpe.thermalcorrgfe: 0.141576 hartree
zpe.sumelectzpe: -474.864339 hartree
zpe.sumelectthermal: -474.853330 hartree
zpe.sumelectthermalent: -474.852386 hartree
zpe.sumelectthermalfe: -474.901903 hartree
dipole: -4.8697 0.7386 -1.2262
dipole: 5.0758
quadrupole: -52.0078 -66.0106 -67.8898
quadrupole: 9.6532 -2.1795 0.9068
quadrupole: 9.9616 -4.0412 -5.9204 9.6532 -2.1795 0.9068
hfenergy: -475.0434788 hartree
pointgroup: C01 [X(C8H11N3)]
dipole: 1.9218287 0.536696 0.080109 debye
dipolederiv: -1.8350448 0.0671473 -0.1646227 0.0964551 -0.3364942 0.0369532 0.249475 -0.0051157 -0.4208446 -2.1083329 0.0641429 -0.0474685 0.3270058 -0.3089258 0.0535708 -0.6012382 0.0574598 -0.4821259 -0.2690621 -0.0970956 0.0797892 -0.0662066 -0.2819262 0.0350224 0.065198 0.0303236 -0.2578015 0.0880361 0.0344614 -0.1712983 0.0735366 0.2732559 0.0138755 -0.4956796 0.0196798 0.2555192 0.5527915 -0.0232101 0.2178325 -0.09396 0.2762029 -0.0053396 0.5122053 -0.001369 0.2502124 2.4851981 -0.1421394 0.1936889 -0.4153741 0.0572968 -0.1107702 0.4119745 -0.0550103 0.4073381 1.6286769 0.0018314 -0.0244017 0.0846211 -0.0321978 0.1047344 -0.2150316 0.0784467 0.0479965 -0.3327198 -0.0301494 0.0082574 0.1891014 0.0079077 -0.1608349 -0.1403213 -0.1187092 -0.0377955 -0.1666688 0.0239055 -0.0991401 -0.3625032 0.1250531 -0.1199935 0.2106887 -0.1609308 -0.0356459 0.0581593 -0.0202404 0.0014988 -0.1294474 -0.007144 -0.079345 0.0845598 -0.0708095 -0.05489 0.1506291 -0.0090095 -0.0470501 0.0672497 -0.0441598 -0.0728672 -0.0794749 -0.0557158 -0.068991 -0.0519256 -0.120403 0.0671863 -0.1925796 -0.0801794 0.0289562 0.0827473 -0.0390892 0.0535981 0.1462334 0.0126669 -0.1335819 0.0013852 0.1242495 0.0208104 -0.0706252 0.0112588 0.0461393 -0.0616731 0.0997359 0.1006319 0.1582753 -0.0799234 -0.0690375 0.1061014 -0.005591 0.055787 -0.1227912 0.1090809 -0.0508318 0.1948453 -0.0735315 -0.007115 -0.0122583 -0.0708043 0.0661461 0.0590014 -0.0248973 0.137877 -0.0049291 0.1164112 0.0305376 0.0279193 0.0301422 -0.0807218 -0.1397085 -0.0865729 -0.0903455 -0.191638 -0.0838765 -0.0454486 -0.0993506 0.0261032 0.0658665 0.0460787 -0.0053506 0.0352888 0.0910005 0.1547473 0.063688 -0.0144959 0.0395695 -0.1808197 0.0902226 -0.054396 0.0588694 -0.0406836 0.0332341 0.0983097 0.0343977 0.0986598 0.0673588 -0.0407646 0.1021135 -0.0398969 0.113825 0.0235605 0.05758 -0.0160183 0.0704048 0.0916183 -0.0262217 0.0911527 -0.0603537 0.1210141 0.0318897 0.0900079 -0.0737378 0.091678 0.0904639 -0.1501141 0.0072256 0.0280708 -0.0209937 0.1045496 0.0367055 0.0329648 0.0294186 0.1215918 unknown
polarizability: 199.5155995|-6.3697085|77.1333565|3.0114559|-19.7684581|79.632366 unknown
InChI: InChI=1S/C8H11N3/c1-11(2)7-10-8-4-3-5-9-6-8/h3-7H,1-2H3
charge 0 multiplicity 1
22 atoms
N  2.941459 0.035378 0.226796
N  0.690441 0.320951 -0.440397
N  -2.576038 -0.950435 0.921158
C  3.452163 0.21576 -1.139254
C  3.92411 -0.121032 1.303845
C  1.588869 0.077235 0.488978
C  -0.685737 0.198144 -0.171193
C  -1.601801 1.086166 -0.803633
C  -1.245325 -0.820522 0.664913
C  -2.981252 0.954851 -0.549717
C  -3.428407 -0.062786 0.32759
H  4.086509 1.121376 -1.204643
H  2.589377 0.327426 -1.813506
H  4.054987 -0.659996 -1.447951
H  4.576796 -0.995582 1.115573
H  3.409452 -0.273949 2.26744
H  4.567923 0.77686 1.392223
H  1.339044 -0.087602 1.554977
H  -1.210171 1.858478 -1.473223
H  -0.59218 -1.581307 1.11355
H  -3.704247 1.629342 -1.020777
H  -4.492072 -0.186858 0.55925
