program: Gaussian 09
title: 000003049
version: EM64L-G09RevD.01
frameworkgroup: C1[X(C18H18O2)]
method: RPBEPBE
basis: SDD
operation: Freq
keyword: #pfreq=noraman
keyword: PBEPBE/SDD
title: #p freq=noraman PBEPBE/SDD
converged: YES YES NO NO
title: Mulliken charges:
elementType: O O C C C C C C C C C C C C C C C C C C H H H H H H H H H H H H H H H H H H
charge: -0.434201 -0.434200 0.212559 0.212795 0.318349 0.318314 -0.326183 -0.326327 -0.381627 -0.381669 -0.374518 -0.374379 -0.412681 -0.412971 -0.353871 -0.354037 0.278191 0.278220 -0.761207 -0.761531 0.232958 0.232998 0.244934 0.245271 0.239453 0.239405 0.217678 0.217679 0.248758 0.248764 0.220918 0.252857 0.224781 0.224811 0.220920 0.253055 0.352866 0.352865
chargesum: 0.00000
title: Mulliken charges with hydrogens summed into heavy atoms:
elementType: O O C C C C C C C C C C C C C C C C C C
charge: -0.081334 -0.081335 0.212559 0.212795 0.318349 0.318314 -0.093225 -0.093330 -0.136692 -0.136398 -0.135065 -0.134974 -0.195002 -0.195292 -0.105113 -0.105273 0.278191 0.278220 -0.062652 -0.062744
polarizability: 2.06651724e+02 1.40692253e-03 2.43400727e+02 2.67588243e+01 5.19169714e-02 1.78821076e+02
1716.lowfreq: -5.1423 -0.0004 0.0005 0.0007 3.4058 7.4795 25.6585 39.8621 52.8109
frequency: 25.6582 39.8571 52.7980 57.2559 81.8144 95.3084 135.7943 147.1640 158.0411 207.0830 211.3698 215.4690 231.0604 263.3033 272.0211 326.8593 336.4446 352.7211 355.9914 376.1127 386.5211 392.2460 416.2488 416.4698 441.7408 471.2599 491.5166 523.9478 594.6098 619.2269 627.3763 635.8740 641.6310 673.9966 733.9254 735.3520 775.2551 806.5875 806.7518 806.9735 820.4253 828.0050 837.8412 851.4534 856.5653 928.2641 937.6362 942.2633 964.9197 966.0278 979.8607 1004.4929 1004.5384 1037.0372 1038.0732 1088.8958 1102.6455 1104.1053 1112.7723 1113.0079 1143.2653 1145.9418 1179.3005 1181.1853 1202.5730 1245.9197 1246.3511 1261.6500 1308.8101 1309.0772 1357.4162 1359.6638 1377.3620 1379.9065 1393.6207 1394.0584 1421.2681 1421.6612 1467.3608 1467.8599 1469.7666 1470.1309 1501.8699 1504.1774 1586.9096 1588.0905 1621.1638 1621.5558 1623.3141 1633.1390 2960.2437 2960.6370 3030.0499 3030.1561 3083.2918 3084.2904 3105.2217 3108.0408 3109.6570 3109.8775 3136.4825 3137.0357 3149.5694 3149.7700 3169.2535 3169.2586 3581.6619 3581.7869
redmass: 5.8108 4.4135 3.6357 3.5269 5.1589 3.3479 5.0827 1.8456 1.8929 1.7895 1.5615 4.1479 2.4075 5.4016 3.1404 4.5317 3.7635 1.1380 1.1257 4.1711 4.1014 3.9218 2.9892 2.9904 4.2347 5.0218 3.1618 2.7523 5.0770 3.0417 6.5700 4.5699 6.6128 3.8785 4.1663 4.0455 4.0129 2.5129 1.9293 1.3780 1.6309 2.1251 1.5627 1.7721 1.2386 1.9162 1.3362 1.3376 1.3587 1.3473 1.9154 2.7684 2.7062 1.5125 1.5077 2.9439 1.4468 1.6986 2.5013 2.3598 1.3608 1.3450 1.1102 1.1133 2.1039 2.3732 2.5741 2.3195 1.3473 1.3468 1.5960 1.7787 4.4045 4.3550 1.2417 1.2309 3.3939 3.3694 1.0788 1.0772 1.0530 1.0531 2.7484 2.7977 6.2904 6.3509 6.7042 6.3894 6.5236 6.8079 1.0395 1.0395 1.0945 1.0945 1.0947 1.0952 1.0919 1.0902 1.0891 1.0894 1.0890 1.0889 1.0944 1.0944 1.0959 1.0959 1.0659 1.0660
irintensity: 0.0141 0.8781 1.6198 0.0586 0.7518 1.0498 0.0025 0.6186 0.3037 0.6582 1.7199 0.4002 0.6457 0.1374 0.0129 0.2560 5.1782 180.1403 87.6308 7.7994 10.1317 16.1403 1.1484 1.2738 2.8241 0.4348 23.2372 18.9491 0.0317 41.0488 0.1067 17.9442 3.4406 1.9414 0.3650 6.4193 2.5456 33.2597 2.8316 32.1108 20.2247 53.7023 27.2037 32.3840 9.6411 47.9663 0.6013 0.1124 0.2018 0.4337 9.6154 1.4318 3.3078 3.6418 1.1136 4.2746 43.2089 36.7692 5.1078 56.6569 179.5721 250.4204 9.8068 8.0249 0.5387 31.7013 25.9688 17.2421 11.4348 9.8724 16.9517 5.2138 42.4755 33.7777 13.9649 5.2492 5.7591 5.9544 15.4978 6.6784 3.9715 19.4689 63.8497 93.8295 6.2895 15.2451 13.1904 55.1955 55.8705 0.5401 63.6574 27.6355 21.9829 25.8984 4.2549 6.1040 48.8039 37.9526 16.2204 6.1262 3.7535 13.9669 6.5044 16.3263 3.1727 9.8243 38.0643 50.7467
temp: 298.150 k
press: 1.00000 atm
elementType: 8 8 6 6 6 6 6 6 6 6 6 6 6 6 6 6 6 6 6 6 1 1 1 1 1 1 1 1 1 1 1 1 1 1 1 1 1 1
symmnumber: 1
zpe: 801492.7 jmol-1
zpe.correction: 0.305272 hartree
zpe.thermalcorrener: 0.324527 hartree
zpe.thermalcorrenthalpy: 0.325471 hartree
zpe.thermalcorrgfe: 0.257370 hartree
zpe.sumelectzpe: -845.700356 hartree
zpe.sumelectthermal: -845.681101 hartree
zpe.sumelectthermalent: -845.680157 hartree
zpe.sumelectthermalfe: -845.748258 hartree
dipole: 0.0027 0.3721 -0.0002
dipole: 0.3721
quadrupole: -105.6164 -112.3408 -113.3632
quadrupole: 0.0090 19.0340 0.0173
quadrupole: 4.8238 -1.9007 -2.9231 0.0090 19.0340 0.0173
hfenergy: -846.0056282 hartree
pointgroup: C01 [X(C18H18O2)]
dipole: 0.0010528 -0.1463816 -0.0000907 debye
polarizability: 197.6413379|0.012248|243.4007118|-29.7592393|0.0598876|187.831478 unknown
InChI: InChI=1S/C18H18O2/c1-3-17(13-5-9-15(19)10-6-13)18(4-2)14-7-11-16(20)12-8-14/h3-12,19-20H,1-2H3
charge 0 multiplicity 1
38 atoms
O  -3.961384 3.05247 -0.321066
O  3.961653 3.051903 0.320937
C  -0.65512 -1.602839 0.374512
C  0.654515 -1.60275 -0.374009
C  -1.527242 -0.395995 0.230781
C  1.526675 -0.395994 -0.230281
C  -0.991285 -2.699297 1.132367
C  0.991059 -2.698888 -1.13207
C  -2.207589 0.180704 1.336609
C  2.209521 0.178514 -1.335672
C  -1.678715 0.233206 -1.037799
C  1.676234 0.234874 1.037693
C  -3.021659 1.322763 1.186645
C  3.02393 1.320359 -1.185907
C  -2.491639 1.368378 -1.20705
C  2.48936 1.369936 1.206724
C  -3.167108 1.913806 -0.090993
C  3.16718 1.913332 0.09109
C  -2.3017 -2.985986 1.830925
C  2.30131 -2.983828 -1.831618
H  -0.227638 -3.485242 1.222648
H  0.227946 -3.485362 -1.222325
H  -2.074596 -0.251034 2.334241
H  2.078523 -0.255047 -2.332804
H  -1.155762 -0.186115 -1.904624
H  1.151452 -0.182902 1.904164
H  -3.527526 1.755347 2.060092
H  3.531828 1.751232 -2.059021
H  -2.61265 1.844847 -2.184332
H  2.608795 1.847822 2.183509
H  -2.212869 -2.886138 2.932033
H  -3.111132 -2.317367 1.494254
H  -2.609697 -4.031576 1.637032
H  2.610937 -4.028965 -1.63791
H  2.21152 -2.884113 -2.93266
H  3.110014 -2.313958 -1.495615
H  -4.380946 3.362903 0.519387
H  4.383008 3.3608 -0.519185
