program: Gaussian 09
title: 000003103
version: EM64L-G09RevD.01
frameworkgroup: C1[X(C19H23NO)]
method: RPBEPBE
basis: SDD
operation: Freq
keyword: #p
keyword: freq=noraman
keyword: PBEPBE/SDD
title: #p freq=noraman PBEPBE/SDD
converged: YES YES NO NO
title: Mulliken charges:
elementType: O N C C C C C C C C C C C C C C C C C C C H H H H H H H H H H H H H H H H H H H H H H H
charge: -0.313303 -0.051520 0.070625 -0.417925 -0.450567 -0.393179 -0.392436 -0.269184 -0.617232 0.360947 0.481632 -0.387738 -0.453734 -0.424292 -0.356426 -0.230605 -0.225179 -0.219251 -0.229612 -0.248879 -0.243008 0.197330 0.186704 0.223434 0.218302 0.210022 0.215048 0.173329 0.174407 0.217307 0.200494 0.223330 0.224043 0.185666 0.242215 0.231413 0.279828 0.256242 0.222976 0.225971 0.222908 0.226354 0.225315 0.228231
chargesum: 0.00000
title: Mulliken charges with hydrogens summed into heavy atoms:
elementType: O N C C C C C C C C C C C C C C C C C C C
charge: -0.313303 -0.051520 0.267955 -0.007788 -0.022243 -0.004802 -0.000722 -0.068690 0.015807 0.360947 0.481632 -0.145523 -0.222321 -0.144464 -0.100184 -0.007629 0.000792 0.003656 -0.003258 -0.023564 -0.014778
polarizability: 2.27642834e+02 8.56075109e+00 2.25455906e+02 -3.18202462e+00 -1.36443978e+01 1.67504234e+02
1716.lowfreq: -18.1700 -6.4843 -0.0005 0.0003 0.0006 6.9698 10.9262 25.5876 32.3282
frequency: -13.6245 25.4783 32.2793 34.0810 55.6399 64.1730 101.9771 142.1348 185.3401 205.6072 209.3946 224.4030 238.5895 248.4575 287.2135 307.8820 336.7169 356.9719 401.9989 404.2050 406.2730 433.4495 460.8688 473.2192 488.3025 533.9984 607.1346 607.6649 615.3470 617.3983 662.5119 705.1974 706.0478 740.1631 743.9849 769.6290 813.7190 826.4728 835.2327 856.0494 860.5979 868.5157 915.3866 924.1963 934.2013 941.7551 977.9479 980.4817 984.5716 985.4971 990.1612 990.7159 997.3931 1000.2195 1021.1219 1026.1146 1028.9127 1038.4132 1068.7067 1079.7178 1083.2317 1089.2252 1123.1597 1131.5507 1142.6674 1146.6768 1170.0518 1172.0357 1179.0565 1184.6651 1189.0559 1201.1163 1211.6947 1255.6841 1267.0543 1270.4932 1273.8283 1291.7601 1309.0398 1313.6277 1317.9947 1336.1269 1339.3036 1353.4447 1360.6306 1376.1169 1382.5427 1386.2609 1431.7652 1434.4971 1442.1881 1449.6197 1462.2729 1463.8264 1464.4220 1480.1186 1480.3658 1481.6579 1482.3848 1591.5899 1594.4884 1610.1754 1614.5222 2808.5794 2820.4264 2854.6051 2925.2866 2944.1215 2990.9092 3005.1644 3017.0609 3024.0213 3030.3624 3059.6840 3073.3187 3075.7476 3109.5581 3118.3138 3124.8144 3126.3444 3136.8154 3139.7843 3148.5673 3157.3097 3163.1070 3178.2389
redmass: 2.9863 3.7168 4.1767 3.8840 4.5333 4.2975 3.7084 4.6268 4.3567 2.2408 2.0104 2.5047 2.5031 2.0307 4.1604 4.5536 2.1221 2.4172 2.8163 2.8776 2.9094 4.9116 3.2572 2.6573 3.1951 3.1722 4.9643 3.4072 6.2710 6.3595 4.3863 2.0876 1.6589 1.9590 2.9551 2.0407 1.4854 3.2509 2.4298 1.2531 1.2525 2.7696 2.3191 1.7067 1.8905 1.7654 1.4026 1.4326 1.6466 2.3410 5.5066 6.1756 1.3334 1.3184 3.4925 2.4035 2.2133 2.4821 1.6630 1.5873 1.5923 1.5747 2.1249 1.9681 1.3251 2.1906 1.0661 1.0707 1.8218 1.1138 1.4261 1.6481 1.8060 1.3794 1.6441 1.5709 1.5987 1.3835 1.3960 1.2678 1.3030 1.2855 1.3297 1.4246 1.5813 1.3921 8.1798 6.5569 1.1749 2.2248 2.1030 1.0982 1.0635 1.0870 1.0729 2.1105 1.1435 2.3064 1.0572 6.2505 6.1540 6.0532 6.1091 1.0717 1.0695 1.0577 1.0813 1.0832 1.0609 1.0619 1.0721 1.0858 1.0864 1.1021 1.1033 1.1009 1.0879 1.0848 1.0858 1.0884 1.0910 1.0939 1.0958 1.0992 1.1014 1.0950
irintensity: 0.4795 0.0050 0.2536 0.0288 0.3850 0.3393 0.0954 0.6351 0.0792 1.3265 0.7879 5.3064 3.0570 0.2447 4.5225 5.6859 3.8828 2.0254 0.2603 0.4360 1.5632 0.7889 3.8688 4.2345 0.9203 4.1575 17.3306 2.3798 2.8122 0.3397 17.2377 40.4408 56.5064 62.5030 9.2249 47.1265 1.1395 3.2661 1.2277 0.2829 0.3355 2.5396 11.4839 4.1421 5.5980 4.7140 1.5819 3.4765 13.0808 25.2352 0.1999 0.4865 0.0832 0.9250 137.6505 42.3754 5.6687 61.5931 22.7938 4.7644 13.7879 8.9319 1.9991 9.3061 1.8301 14.5613 0.9048 0.3707 8.5310 3.1953 4.5541 0.9498 1.8711 7.8857 5.6768 19.1049 15.5854 29.4422 1.3873 7.3325 2.9215 4.9247 1.3261 27.8535 10.8652 1.4280 0.5014 0.4370 3.0249 11.3610 10.3158 10.9150 19.3776 13.2842 3.7890 4.4309 13.9114 27.4581 7.8905 1.2053 0.2457 3.7357 7.2082 50.5237 91.3702 196.7363 29.3542 30.8187 34.2256 18.1450 46.6540 70.3991 34.4021 25.2392 39.7152 35.8313 9.9820 2.5964 0.0193 4.4053 17.0444 36.0031 31.2046 34.8489 24.0302 7.8294
temp: 298.150 k
press: 1.00000 atm
elementType: 8 7 6 6 6 6 6 6 6 6 6 6 6 6 6 6 6 6 6 6 6 1 1 1 1 1 1 1 1 1 1 1 1 1 1 1 1 1 1 1 1 1 1 1
symmnumber: 1
zpe: 979466.2 jmol-1
zpe.correction: 0.373059 hartree
zpe.thermalcorrener: 0.391268 hartree
zpe.thermalcorrenthalpy: 0.392212 hartree
zpe.thermalcorrgfe: 0.325234 hartree
zpe.sumelectzpe: -866.225325 hartree
zpe.sumelectthermal: -866.207116 hartree
zpe.sumelectthermalent: -866.206172 hartree
zpe.sumelectthermalfe: -866.273150 hartree
dipole: 1.1611 1.9868 -0.6736
dipole: 2.3977
quadrupole: -118.2241 -120.6877 -120.5269
quadrupole: 1.8461 -0.6702 -2.2347
quadrupole: 1.5888 -0.8748 -0.7140 1.8461 -0.6702 -2.2347
hfenergy: -866.5983839 hartree
pointgroup: C01 [X(C19H23N1O1)]
dipole: 0.3653832 -0.7210401 0.4862969 debye
polarizability: 225.7094086|-7.3360784|215.4865853|4.8115367|-27.6446071|179.406981 unknown
InChI: InChI=1S/C19H23NO/c1-20-14-12-18(13-15-20)21-19(16-8-4-2-5-9-16)17-10-6-3-7-11-17/h2-11,18-19H,12-15H2,1H3
charge 0 multiplicity 1
44 atoms
O  0.437866 0.685118 -0.547804
N  4.648282 0.51699 0.06964
C  1.747741 0.132659 -0.139128
C  2.382687 0.918056 1.028091
C  2.644398 0.21579 -1.382624
C  3.8173 0.410232 1.29101
C  4.072219 -0.264055 -1.050985
C  -0.675488 0.432457 0.391766
C  6.061255 0.177076 0.321621
C  -1.864782 1.271707 -0.090628
C  -0.983612 -1.062903 0.497013
C  -3.153864 1.043989 0.454931
C  -0.869426 -1.740058 1.734239
C  -1.690281 2.312827 -1.034046
C  -1.368164 -1.793822 -0.65625
C  -4.249504 1.845992 0.067669
C  -1.141925 -3.125626 1.826795
C  -2.789407 3.111109 -1.426546
C  -1.635256 -3.176019 -0.569584
C  -4.071411 2.884585 -0.876218
C  -1.525044 -3.846512 0.673697
H  1.620561 -0.932735 0.15564
H  1.786339 0.81167 1.954702
H  2.415871 1.989824 0.758348
H  2.67937 1.265817 -1.726752
H  2.213931 -0.398346 -2.194605
H  4.287135 1.015154 2.088927
H  3.772118 -0.649954 1.662828
H  4.048276 -1.361847 -0.810985
H  4.723718 -0.1385 -1.935664
H  -0.388739 0.796967 1.404372
H  6.467091 0.832032 1.113617
H  6.653583 0.344146 -0.59598
H  6.213627 -0.886095 0.641188
H  -3.302171 0.230825 1.175519
H  -0.568042 -1.181476 2.630209
H  -0.695119 2.478798 -1.454303
H  -1.451547 -1.268376 -1.614304
H  -5.240168 1.658218 0.497364
H  -1.053249 -3.638735 2.791082
H  -2.643067 3.911583 -2.161106
H  -1.932523 -3.732817 -1.465593
H  -4.921545 3.50608 -1.179987
H  -1.736237 -4.919827 0.740522
