program: Gaussian 09
title: 000003079
version: EM64L-G09RevD.01
frameworkgroup: C1[X(C18H25N)]
method: RPBEPBE
basis: SDD
operation: Freq
keyword: #pfreq=noraman
keyword: PBEPBE/SDD
title: #p freq=noraman PBEPBE/SDD
converged: NO YES NO NO
title: Mulliken charges:
elementType: N C C C C C C C C C C C C C C C C C C H H H H H H H H H H H H H H H H H H H H H H H H H
charge: -0.064456 0.228505 -0.114802 -0.185102 -0.504642 -0.489974 -0.471967 0.270439 -0.608021 -0.424372 -0.432207 -0.399137 0.296312 -0.550357 -0.636407 -0.402457 0.442163 -0.441113 -0.824419 0.211134 0.212843 0.217634 0.203370 0.211060 0.186243 0.233108 0.185217 0.228438 0.224813 0.210137 0.207261 0.195944 0.201806 0.199285 0.187464 0.230499 0.185763 0.219619 0.224112 0.229686 0.228576 0.221115 0.232160 0.224725
chargesum: 0.00000
title: Mulliken charges with hydrogens summed into heavy atoms:
elementType: N C C C C C C C C C C C C C C C C C C
charge: -0.064456 0.228505 0.096332 0.027741 -0.083637 -0.092672 -0.053641 0.270439 -0.154770 -0.006974 -0.034457 -0.012388 0.296312 -0.319858 -0.006912 -0.172771 0.442163 -0.212537 -0.146419
polarizability: 2.26807982e+02 2.64876280e+00 1.94531991e+02 2.89026185e+00 1.39266954e+01 1.47914805e+02
1716.lowfreq: -18.1443 -13.4381 -0.0009 -0.0005 0.0007 10.1673 48.9881 52.2387 81.6932
frequency: 48.9499 52.1269 81.6034 104.9462 143.4495 158.4317 181.3588 190.2195 218.4087 253.5496 264.7891 286.9795 289.4185 319.8972 325.0436 337.3652 361.4358 378.9865 391.1435 436.7988 453.6745 465.0183 472.9223 486.1434 533.5118 593.7275 597.7358 632.5406 680.7482 689.9657 699.9556 736.4552 772.6105 782.2486 804.7385 817.5009 858.3175 864.4137 881.6644 892.5667 897.8556 935.0708 940.3767 958.4408 968.6592 983.3204 988.2387 1001.7940 1007.9224 1044.1537 1046.6428 1063.6282 1073.9064 1087.3483 1091.9577 1106.9646 1115.8659 1120.6548 1136.1099 1148.1015 1158.5198 1164.7852 1180.2570 1203.2281 1205.0439 1214.6224 1231.4088 1237.7534 1243.9957 1265.1415 1276.8290 1279.6466 1292.5579 1306.4082 1316.4846 1332.1559 1333.1116 1335.5257 1340.0041 1350.8287 1356.5555 1358.0262 1369.9030 1376.4319 1396.3288 1405.4743 1430.9878 1443.7316 1449.3091 1458.2515 1462.6622 1464.0020 1467.8101 1472.5992 1475.1881 1479.8042 1481.1741 1494.6250 1496.7203 1580.5644 1619.2995 2849.3645 2869.6809 2947.9348 2953.6109 2958.4735 2961.9090 2971.5206 2974.4617 2975.6165 2982.1005 2986.4432 3003.4880 3005.0982 3006.0154 3018.9975 3021.4025 3033.2531 3043.1664 3051.2079 3052.3646 3064.5600 3080.0697 3103.1649 3125.3618 3132.8369
redmass: 3.3364 1.0220 3.6517 2.9154 2.6367 2.4900 3.1564 2.5151 1.3132 2.0560 2.7021 2.5931 2.1886 1.9272 2.7449 4.0427 2.7435 3.2620 2.9312 3.3486 2.5967 2.3424 3.4718 3.3611 2.3763 3.0830 3.6788 3.3007 4.9178 3.9399 3.2841 3.2336 2.2999 2.6269 1.8595 1.4254 2.4726 1.9530 2.0528 1.7774 1.5523 1.9644 1.9906 1.5278 2.3310 2.0720 2.5093 1.5252 1.8203 2.0759 1.5623 1.8054 2.0785 2.0279 1.6106 1.8094 1.4493 1.9941 1.9630 2.1461 1.5612 1.4559 2.2924 1.7067 1.9683 1.3457 1.8370 1.4497 1.5988 1.7544 1.7935 1.5011 1.4753 1.4347 1.4180 1.5697 1.5054 1.4606 1.4010 1.5030 1.4910 1.3595 4.4801 1.4676 1.2334 2.9765 1.1724 1.1005 1.0908 1.0888 1.0675 1.0837 1.0887 1.0638 1.0977 1.0859 1.0763 1.1224 2.4418 6.2383 6.4276 1.0580 1.0699 1.0821 1.0643 1.0627 1.0597 1.0382 1.0650 1.0639 1.0802 1.0646 1.0759 1.0903 1.0872 1.0996 1.0955 1.1020 1.1010 1.0957 1.1004 1.1004 1.0993 1.0870 1.0900 1.0959
irintensity: 0.1004 0.4629 0.0392 2.0495 0.2266 0.1596 0.1103 1.9729 0.4386 2.0473 0.5285 0.8264 0.0346 0.1390 0.7154 1.4850 2.6447 0.5392 0.1456 0.8533 9.8224 1.8380 3.7325 0.4086 4.1044 1.4625 1.6074 0.2666 1.8069 5.2835 3.9894 2.0408 0.3856 1.5080 6.4240 26.8220 8.2121 1.0283 0.0957 1.3854 6.2934 5.0430 2.9770 0.5538 4.4620 15.1368 8.6928 6.0829 3.3817 3.5087 16.0961 4.8409 6.7625 2.5070 10.7927 3.3703 1.7486 6.7719 5.3052 7.4270 14.5047 1.3234 10.7946 4.8230 0.4009 5.1525 0.2701 1.2606 3.7893 0.6249 4.9005 7.3538 1.0973 8.2744 5.2996 4.7466 2.2490 4.9110 0.4769 0.1739 0.3637 7.2314 3.8525 7.4444 8.7643 0.8512 5.9243 14.1439 6.8956 6.9121 16.8442 7.2004 7.7806 14.1444 12.7702 10.8427 4.6878 10.0259 41.7581 1.9175 7.8931 95.8262 112.2298 18.7530 17.2955 37.1287 40.8426 47.0492 21.0338 21.5276 113.9358 19.8247 69.6864 30.7085 39.8525 38.6370 81.8990 24.0575 60.5740 24.1490 73.0529 34.8867 20.3872 14.4282 25.9410 25.4569
temp: 298.150 k
press: 1.00000 atm
elementType: 7 6 6 6 6 6 6 6 6 6 6 6 6 6 6 6 6 6 6 1 1 1 1 1 1 1 1 1 1 1 1 1 1 1 1 1 1 1 1 1 1 1 1 1
symmnumber: 1
zpe: 1018250.8 jmol-1
zpe.correction: 0.387831 hartree
zpe.thermalcorrener: 0.404791 hartree
zpe.thermalcorrenthalpy: 0.405735 hartree
zpe.thermalcorrgfe: 0.344589 hartree
zpe.sumelectzpe: -754.234953 hartree
zpe.sumelectthermal: -754.217993 hartree
zpe.sumelectthermalent: -754.217049 hartree
zpe.sumelectthermalfe: -754.278195 hartree
dipole: 0.2024 -0.2029 -0.0053
dipole: 0.2866
quadrupole: -114.1313 -110.3355 -114.6740
quadrupole: 1.5319 1.3085 2.7555
quadrupole: -1.0844 2.7115 -1.6271 1.5319 1.3085 2.7555
hfenergy: -754.6227839 hartree
pointgroup: C01 [X(C18H25N1)]
dipole: 0.0835378 -0.0757338 -0.0016421 debye
polarizability: 226.3992944|4.0658007|194.6710268|3.1350562|14.442811|148.1844567 unknown
InChI: InChI=1S/C18H25N/c1-13-6-7-14-12-17-15-5-3-4-8-18(15,16(14)11-13)9-10-19(17)2/h6-7,11,15,17H,3-5,8-10,12H2,1-2H3
charge 0 multiplicity 1
44 atoms
N  -1.848413 -1.830092 0.614441
C  -0.533172 0.768325 0.224926
C  -1.490611 0.151875 -0.85045
C  -1.424799 -1.391142 -0.745762
C  -0.953663 0.249475 1.641491
C  -0.629249 2.324472 0.170349
C  -2.936724 0.69316 -0.77429
C  0.906942 0.278266 -0.053789
C  -0.006354 -1.858776 -1.192576
C  -1.012917 -1.288924 1.712103
C  -2.078199 2.867946 0.226061
C  -2.969323 2.234451 -0.865939
C  1.136511 -0.975626 -0.694009
C  2.028338 1.031198 0.37972
C  -2.083857 -3.277475 0.736251
C  2.469938 -1.413372 -0.886858
C  3.362604 0.598736 0.187144
C  3.570902 -0.64625 -0.456405
C  4.533726 1.456809 0.637507
H  -1.085681 0.430362 -1.848445
H  -2.163987 -1.827967 -1.448065
H  -1.948372 0.653149 1.902906
H  -0.233037 0.624283 2.394373
H  -0.151288 2.670964 -0.769185
H  -0.051788 2.769625 1.004232
H  -3.41375 0.347874 0.161821
H  -3.524226 0.250606 -1.604375
H  0.014077 -1.872965 -2.302498
H  0.167839 -2.907121 -0.877194
H  0.022166 -1.712344 1.700519
H  -1.471976 -1.595845 2.672346
H  -2.055215 3.969483 0.111054
H  -2.52264 2.667573 1.221371
H  -4.009135 2.604593 -0.775147
H  -2.601321 2.55109 -1.864565
H  1.867904 1.991531 0.883569
H  -1.154873 -3.901534 0.700567
H  -2.750752 -3.616214 -0.077742
H  -2.585254 -3.489348 1.699142
H  2.643684 -2.380172 -1.377569
H  4.592372 -1.013257 -0.61522
H  5.457907 0.860187 0.733655
H  4.738442 2.268349 -0.08798
H  4.33482 1.93564 1.613515
