program: Gaussian 09
title: 000033419
version: EM64L-G09RevD.01
frameworkgroup: C1[X(C13H25N5)]
method: RPBEPBE
basis: SDD
operation: Freq
keyword: #pfreq=noraman
keyword: PBEPBE/SDD
title: #p freq=noraman PBEPBE/SDD
converged: YES YES NO NO
title: Mulliken charges:
elementType: N N N N N C C C C C C C C C C C C C H H H H H H H H H H H H H H H H H H H H H H H H H
charge: -0.349708 -0.349134 -0.107461 -0.107512 -0.124861 -0.364556 -0.469004 -0.338324 -0.020883 -0.023502 0.044000 0.039894 0.040803 -0.697073 -0.716737 -0.676689 -0.714257 -0.675459 0.209035 0.208663 0.212222 0.212302 0.195662 0.195671 0.235448 0.236734 0.317730 0.317048 0.211104 0.211015 0.214291 0.221808 0.205281 0.232889 0.249566 0.205321 0.202995 0.233471 0.204608 0.221311 0.202603 0.205885 0.247797
chargesum: 0.00000
title: Mulliken charges with hydrogens summed into heavy atoms:
elementType: N N N N N C C C C C C C C C C C C C
charge: -0.031978 -0.032086 -0.107461 -0.107512 -0.124861 0.053142 -0.044480 0.053009 0.214565 0.213232 0.044000 0.039894 0.040803 -0.060662 -0.056760 -0.018806 -0.054867 -0.019173
polarizability: 2.24267728e+02 -4.53716096e-01 2.06469404e+02 -8.38191623e+00 -2.11320058e+00 1.32478076e+02
1716.lowfreq: -8.9766 -4.5709 -0.0001 0.0005 0.0009 6.9192 27.1561 30.6199 38.9608
frequency: 25.5371 30.2845 38.9490 40.9038 56.8270 68.7295 73.4968 92.8742 113.0119 146.6431 180.6325 182.6516 204.6992 209.7775 212.8608 230.2780 241.0133 241.6085 250.8110 255.9988 309.3331 339.1286 344.0506 382.5827 401.6357 434.1230 445.1086 468.3305 518.6448 552.3401 559.9544 585.8664 650.1933 689.6215 716.4246 729.8291 733.3224 790.6561 808.9112 830.0686 844.3886 895.0923 901.2470 917.6458 918.3292 922.8218 930.7221 935.0744 946.1615 954.1758 1006.3606 1029.3726 1049.3895 1068.8894 1106.3466 1121.7255 1136.9608 1140.8382 1160.5470 1164.9900 1184.8353 1194.1408 1202.6596 1217.4339 1253.6656 1270.3131 1273.5464 1286.6870 1304.4018 1314.6027 1330.9836 1344.1266 1346.0929 1358.2234 1367.3702 1373.4013 1374.0937 1391.5780 1393.2287 1394.2014 1413.2517 1451.0003 1461.0144 1461.6968 1467.1381 1467.9044 1468.2735 1475.9704 1476.2902 1478.4495 1478.5843 1486.3057 1486.6727 1487.0561 1490.6719 1503.6842 1521.2898 1578.5991 2965.6225 2972.5839 2975.6051 2975.8620 2978.2446 2979.2979 2979.7260 3008.1213 3010.0394 3016.8672 3020.0399 3038.3638 3068.9094 3068.9686 3069.7181 3070.4641 3078.5496 3079.2387 3083.1175 3092.0146 3092.2208 3094.6286 3094.8045 3550.7744 3551.6686
redmass: 3.4660 2.6753 2.6335 3.8253 3.7146 1.5276 3.3081 4.1737 2.3645 3.2237 7.7379 4.8774 3.6814 1.0252 1.0239 1.2034 1.5581 1.6970 1.1845 2.5145 2.7565 2.5357 3.0078 2.9863 2.7697 2.9107 2.9736 3.0597 3.0918 1.1707 1.1154 4.8638 6.2677 5.8623 11.6576 4.8085 1.0845 1.2292 9.3227 2.9246 2.3630 3.6362 2.9367 1.2508 1.2732 1.3055 2.1185 1.5342 1.5354 1.8229 3.2512 2.5104 2.2269 2.5845 2.1747 2.1656 2.1356 2.1630 2.0130 2.2337 2.3910 2.5940 2.5869 1.8166 1.3281 1.2525 1.6596 1.0744 1.5344 1.4918 1.6928 1.3918 1.5689 1.5183 1.6309 1.2129 1.2131 1.2159 1.2403 1.2372 2.5373 1.1635 1.0640 1.0640 1.0691 1.0481 1.0473 1.0910 1.1147 1.0876 1.0816 1.0832 1.0954 1.0728 2.2044 2.1875 9.9689 6.5640 1.0577 1.0376 1.0374 1.0370 1.0586 1.0364 1.0361 1.0998 1.0582 1.0845 1.0847 1.1034 1.0984 1.0987 1.1010 1.0993 1.0988 1.0988 1.1046 1.0999 1.0998 1.0999 1.0998 1.0766 1.0767
irintensity: 0.1124 0.0590 0.0113 1.6551 0.0084 0.0303 0.2443 1.5625 0.1874 2.1292 0.0737 4.5023 0.1062 0.1188 0.1107 0.0143 0.2695 0.1887 0.2933 0.1581 0.8300 1.1831 2.7499 0.7387 0.3561 3.2020 0.4253 7.3284 8.3091 147.1188 22.4218 18.1510 0.4945 14.1803 0.0431 12.0895 7.6043 1.6686 19.9063 1.9216 0.5235 17.7809 1.5424 4.0465 4.1619 0.0287 0.5031 0.9526 1.1632 8.9153 2.4341 0.9083 1.2161 7.7394 35.1965 46.2386 8.7299 17.4876 1.0812 0.8367 51.3876 105.8890 2.9116 2.9141 5.7072 1.5198 1.8664 0.9808 4.4168 0.8082 1.7172 5.9473 0.8947 47.5002 11.7505 23.8300 23.0223 12.1292 15.2766 44.1391 187.3169 5.5754 20.6097 3.9610 0.0902 6.4640 5.0246 12.3401 20.0461 29.4038 26.9718 14.2164 38.3829 26.4723 216.5706 94.0709 1292.0827 396.0672 22.4146 35.1670 30.3788 20.9116 40.9643 48.3411 28.1095 3.3875 34.2605 3.3601 2.3070 13.9540 2.8658 14.2267 51.6816 59.1888 60.1207 66.8669 52.5978 20.7895 31.2393 44.0015 35.7883 93.1871 6.3626
temp: 298.150 k
press: 1.00000 atm
elementType: 7 7 7 7 7 6 6 6 6 6 6 6 6 6 6 6 6 6 1 1 1 1 1 1 1 1 1 1 1 1 1 1 1 1 1 1 1 1 1 1 1 1 1
symmnumber: 1
zpe: 981438.4 jmol-1
zpe.correction: 0.373810 hartree
zpe.thermalcorrener: 0.395128 hartree
zpe.thermalcorrenthalpy: 0.396073 hartree
zpe.thermalcorrgfe: 0.321724 hartree
zpe.sumelectzpe: -782.755011 hartree
zpe.sumelectthermal: -782.733693 hartree
zpe.sumelectthermalent: -782.732749 hartree
zpe.sumelectthermalfe: -782.807097 hartree
dipole: -2.5370 0.0382 0.7833
dipole: 2.6554
quadrupole: -103.8433 -98.0000 -113.3513
quadrupole: 0.0176 -1.1050 -0.4553
quadrupole: 1.2215 7.0649 -8.2864 0.0176 -1.1050 -0.4553
hfenergy: -783.128821 hartree
pointgroup: C01 [X(C13H25N5)]
dipole: -1.0003788 0.0170633 0.3006279 debye
polarizability: 224.3870147|-0.4399445|206.5203974|-7.682795|-0.9817461|132.3077955 unknown
InChI: InChI=1S/C13H25N5/c1-6-7-8-11-16-12(14-9(2)3)18-13(17-11)15-10(4)5/h9-10,14-15H,6-8H2,1-5H3
charge 0 multiplicity 1
43 atoms
N  -1.150897 -2.339579 -0.035376
N  -1.102646 2.370673 -0.157407
N  0.867365 1.196053 -0.596176
N  0.839901 -1.230162 -0.544438
N  -1.216166 0.017072 -0.071767
C  3.795313 -0.037476 0.280811
C  2.94499 -0.049799 -1.020299
C  5.313506 -0.057939 -0.005878
C  -2.587393 -2.477334 0.282708
C  -2.521139 2.555854 0.211999
C  1.46637 -0.027108 -0.716014
C  -0.504081 -1.14621 -0.221987
C  -0.477783 1.156507 -0.270449
C  6.161996 -0.046301 1.284243
C  -2.817441 -3.832465 0.980894
C  -3.461551 -2.319787 -0.9853
C  -3.019012 3.897599 -0.361819
C  -2.716988 2.469412 1.745291
H  3.520777 -0.915386 0.898845
H  3.539793 0.865925 0.869668
H  3.175357 -0.96238 -1.598757
H  3.195833 0.837207 -1.629171
H  5.559662 -0.95824 -0.605031
H  5.57823 0.817483 -0.633297
H  -2.838357 -1.653322 0.976315
H  -3.078723 1.721682 -0.252466
H  -0.57873 -3.173067 -0.185342
H  -0.500473 3.184943 -0.295272
H  5.936165 -0.927376 1.914155
H  5.953854 0.858224 1.886451
H  7.244184 -0.060481 1.057648
H  -3.8816 -3.946068 1.25139
H  -2.552009 -4.673982 0.311393
H  -2.213828 -3.914441 1.902411
H  -3.264692 -1.344228 -1.461553
H  -4.53512 -2.370658 -0.724379
H  -3.242727 -3.121207 -1.715245
H  -2.905669 3.928629 -1.460163
H  -2.458176 4.748319 0.072621
H  -4.0858 4.044086 -0.118362
H  -2.172057 3.284095 2.257576
H  -3.788931 2.551464 2.004956
H  -2.341007 1.502371 2.120773
