program: Gaussian 09
title: 000033474
version: EM64L-G09RevD.01
frameworkgroup: C1[X(C15H16N4O)]
method: RPBEPBE
basis: SDD
operation: Freq
keyword: #p
keyword: freq=noraman
keyword: PBEPBE/SDD
title: #p freq=noraman PBEPBE/SDD
converged: YES YES NO NO
title: Mulliken charges:
elementType: O N N N N C C C C C C C C C C C C C C C H H H H H H H H H H H H H H H H
charge: -0.223432 -0.203882 -0.360071 -0.079217 -0.032487 0.232128 0.029198 -0.016310 0.091997 -0.354671 0.346825 -0.561728 0.098655 -0.788877 -0.663024 -0.385391 -0.384971 -0.235984 -0.229499 -0.237356 0.242614 0.252370 0.328166 0.263968 0.231515 0.237044 0.233918 0.257601 0.225645 0.223404 0.236372 0.259403 0.272343 0.231603 0.230229 0.231903
chargesum: 0.00000
title: Mulliken charges with hydrogens summed into heavy atoms:
elementType: O N N N N C C C C C C C C C C C C C C C
charge: -0.223432 -0.203882 -0.031905 -0.079217 -0.032487 0.232128 0.029198 -0.016310 0.091997 0.140313 0.346825 -0.066245 0.098655 -0.060315 0.022398 -0.125988 -0.112628 -0.004381 0.000730 -0.005453
polarizability: 2.55455736e+02 -9.69557988e+00 1.96831867e+02 4.98721345e+00 2.27239073e+01 1.38923982e+02
1716.lowfreq: -19.4946 -8.3129 -0.0004 -0.0004 0.0005 5.4221 8.1020 46.4737 62.6592
frequency: -16.5084 46.4363 62.6518 64.2655 84.6479 109.1417 116.4041 133.7866 159.8876 195.2592 206.3961 239.2422 255.5764 280.0033 299.4925 330.6522 354.1475 383.1454 394.2357 405.5023 431.6813 448.9722 493.4963 528.9983 568.6811 593.5287 613.6706 624.8127 635.3493 652.3995 659.9213 676.1893 700.4137 715.0086 749.5957 784.0890 792.2788 850.1345 861.5419 893.3150 933.1427 938.3755 961.7452 982.3769 986.4457 989.3768 996.1980 1001.8174 1008.9408 1029.5757 1046.1149 1053.3859 1084.2418 1086.1936 1133.8539 1169.8807 1173.4309 1187.9458 1200.1765 1237.0438 1269.9325 1305.9140 1311.1041 1320.8743 1328.2934 1347.5035 1357.0126 1381.5313 1385.0140 1387.1419 1401.3810 1432.1378 1437.0207 1453.3315 1467.5050 1468.1859 1471.4527 1476.1834 1482.9350 1484.0079 1514.8907 1528.9308 1552.4939 1586.9524 1610.1815 1643.3863 2924.8093 2977.2510 2989.7618 3039.6430 3052.5830 3083.9665 3092.7034 3105.4233 3107.0875 3113.3958 3125.3032 3133.5222 3145.8283 3158.8806 3170.0928 3516.2991
redmass: 2.4973 3.9060 3.9239 6.4086 3.7381 1.5049 2.4783 3.2357 3.9722 1.6170 2.2615 4.8549 2.4300 3.6689 3.6445 5.8339 3.9849 6.0376 4.4455 2.8785 4.6433 4.6837 3.2624 3.4270 3.5624 2.7435 5.6220 3.7634 5.7401 4.5585 3.9420 3.1777 2.0456 3.8021 4.1080 2.1892 1.2567 5.2582 1.2487 4.4032 2.8390 1.5037 4.9639 1.8344 1.4323 5.1257 2.3482 1.3499 3.7874 2.0882 1.4720 2.5094 1.6477 1.9618 3.2595 1.8230 1.0753 1.1411 1.9509 2.3625 3.5126 1.8201 1.5391 1.3941 2.7546 1.8617 1.7862 6.4466 1.6889 1.3542 1.2298 2.5945 3.0925 1.1202 1.0784 1.0419 1.1094 1.2023 1.0687 2.2078 6.7945 6.9773 8.0771 6.2884 6.0588 6.3883 1.0683 1.0392 1.0352 1.0601 1.0971 1.1008 1.0995 1.0972 1.0927 1.1048 1.0853 1.0883 1.0930 1.0963 1.1000 1.0760
irintensity: 0.0338 0.4387 0.0904 0.3705 0.2522 2.9798 0.3625 3.2047 0.8849 2.3339 1.1437 2.2387 0.1471 6.9866 7.1778 1.4278 0.7323 2.0932 8.1654 0.1343 1.7448 12.2754 4.3107 1.4662 14.5200 39.0260 0.8216 8.0024 18.2258 6.6406 22.7451 30.3703 28.8391 50.3346 21.6263 29.3811 6.4833 5.0760 1.6647 11.4141 8.3502 5.6669 14.2946 2.4096 2.3930 1.1159 11.0883 0.8452 12.0048 9.1886 4.1960 20.2327 8.4887 12.6665 0.9100 18.4223 0.5629 4.2309 9.6575 27.7885 52.6770 33.4282 8.4989 9.6507 45.1220 15.3523 5.8746 0.4966 7.3096 12.4702 8.9979 14.8927 71.7222 4.9004 21.0822 14.5957 10.0800 16.9532 11.0002 5.9543 49.7560 11.8118 42.6837 0.0991 1.4174 534.6553 35.5092 33.5993 17.6623 15.9086 17.1891 18.3107 26.5508 7.3150 14.8909 16.1158 1.6547 3.0164 23.5093 20.5734 19.5810 30.2588
temp: 298.150 k
press: 1.00000 atm
elementType: 8 7 7 7 7 6 6 6 6 6 6 6 6 6 6 6 6 6 6 6 1 1 1 1 1 1 1 1 1 1 1 1 1 1 1 1
symmnumber: 1
zpe: 752074.7 jmol-1
zpe.correction: 0.286450 hartree
zpe.thermalcorrener: 0.303474 hartree
zpe.thermalcorrenthalpy: 0.304419 hartree
zpe.thermalcorrgfe: 0.241832 hartree
zpe.sumelectzpe: -873.988606 hartree
zpe.sumelectthermal: -873.971582 hartree
zpe.sumelectthermalent: -873.970637 hartree
zpe.sumelectthermalfe: -874.033224 hartree
dipole: 1.6207 -4.5492 0.2754
dipole: 4.8371
quadrupole: -104.5489 -136.6282 -110.0543
quadrupole: 6.7137 2.1511 2.4279
quadrupole: 12.5282 -19.5511 7.0228 6.7137 2.1511 2.4279
hfenergy: -874.2750561 hartree
pointgroup: C01 [X(C15H16N4O1)]
dipole: -0.8466052 -1.642741 0.454287 debye
polarizability: 256.9548044|1.85349|175.7409285|-0.9245966|-35.5267042|158.5158527 unknown
InChI: InChI=1S/C15H16N4O/c1-3-19-15-13(10(2)18-19)17-12(20)9-16-14(15)11-7-5-4-6-8-11/h4-8,17H,3,9H2,1-2H3
charge 0 multiplicity 1
36 atoms
O  3.257493 2.76757 -0.891071
N  0.2391 -1.839174 0.419582
N  2.632176 0.859354 0.28151
N  1.322847 -2.475293 1.014501
N  0.107973 1.407581 -1.392005
C  0.541984 -0.524195 0.051227
C  1.894041 -0.328339 0.438313
C  -0.340394 0.499324 -0.53734
C  2.330345 -1.548701 1.046228
C  -0.90113 -2.680573 0.003353
C  -1.770067 0.613488 -0.110358
C  1.506354 1.311379 -1.875987
C  2.538296 1.736511 -0.811143
C  3.663763 -1.866197 1.659399
C  -0.747218 -3.204218 -1.438871
C  -2.190234 0.208533 1.185531
C  -2.718906 1.195655 -0.992503
C  -3.532518 0.380496 1.588047
C  -4.060648 1.35879 -0.592075
C  -4.473326 0.951206 0.699685
H  -0.931627 -3.51811 0.719413
H  -1.829292 -2.096737 0.108182
H  3.362068 1.085378 0.963658
H  1.627615 1.998603 -2.725686
H  1.758856 0.274066 -2.194384
H  4.492682 -1.631684 0.966154
H  3.83744 -1.29709 2.593023
H  3.711838 -2.938757 1.90731
H  -0.72524 -2.372708 -2.165562
H  -1.602339 -3.856161 -1.6926
H  0.181673 -3.790964 -1.543738
H  -1.461396 -0.2152 1.88615
H  -2.376633 1.525148 -1.978373
H  -3.841847 0.076672 2.594201
H  -4.78484 1.805413 -1.282333
H  -5.515688 1.081332 1.011464
