program: Gaussian 09
title: 000033428
version: EM64L-G09RevD.01
frameworkgroup: C1[X(C12H23N5)]
method: RPBEPBE
basis: SDD
operation: Freq
keyword: #pfreq=noraman
keyword: PBEPBE/SDD
title: #p freq=noraman PBEPBE/SDD
converged: YES YES NO NO
title: Mulliken charges:
elementType: N N N N N C C C C C C C C C C C C H H H H H H H H H H H H H H H H H H H H H H H
charge: -0.095365 -0.098786 -0.335688 -0.336418 -0.124752 -0.375663 -0.347282 -0.484389 -0.346025 0.068884 -0.697453 0.022393 0.027007 -0.302804 -0.303269 -0.719059 -0.718934 0.219312 0.195954 0.206109 0.183482 0.222120 0.215857 0.189037 0.193593 0.210354 0.212549 0.209069 0.321037 0.321261 0.230623 0.233893 0.229853 0.232516 0.221651 0.219452 0.229277 0.221224 0.220237 0.229142
chargesum: 0.00000
title: Mulliken charges with hydrogens summed into heavy atoms:
elementType: N N N N N C C C C C C C C C C C C
charge: -0.095365 -0.098786 -0.014650 -0.015157 -0.124752 0.039604 0.042309 -0.046412 0.036605 0.068884 -0.065482 0.022393 0.027007 0.161711 0.159100 -0.048679 -0.048330
polarizability: 1.91399402e+02 -2.38134262e+01 1.97510277e+02 -1.39007655e+01 -1.03288226e+01 1.32126752e+02
1716.lowfreq: -25.1321 -4.7245 -0.7895 -0.0007 -0.0006 -0.0004 6.6232 18.2416 21.7727
frequency: -24.8677 18.0432 19.3508 36.5554 61.5221 68.4899 90.4943 105.2493 123.5475 124.6484 148.3964 176.7762 183.4658 210.8809 224.3082 240.9098 262.3283 270.2468 294.2456 299.5252 363.9361 371.3999 383.4337 438.9862 512.8240 525.5984 529.0763 551.5482 650.4045 675.5486 694.0524 717.7113 730.6471 782.8555 793.2742 794.1089 810.4739 847.2504 882.5897 892.7140 908.0910 916.0174 930.9211 972.5580 1005.1166 1020.2197 1051.6376 1062.9953 1078.8670 1092.9012 1107.7125 1116.1554 1145.2970 1145.3869 1153.7999 1175.1251 1187.5164 1213.1953 1248.9537 1258.3616 1258.9709 1261.7201 1274.0939 1280.2641 1290.2033 1316.4027 1332.6445 1335.6707 1353.8513 1358.0106 1388.1065 1395.6701 1396.7118 1406.6321 1414.3173 1437.5504 1452.3544 1460.7138 1465.9154 1476.2834 1476.9279 1477.7027 1477.7312 1480.2946 1481.0675 1486.5947 1493.0542 1499.0333 1503.1836 1543.6163 1585.1160 2958.7263 2965.6400 2970.5960 2976.2968 2982.1705 2982.4175 2989.3319 2990.8132 2997.7855 2998.0263 3020.7767 3029.9155 3031.7448 3045.2260 3067.5942 3068.6536 3074.8036 3077.3386 3077.6095 3092.6155 3092.7667 3564.3914 3565.4038
redmass: 2.1100 2.1973 3.8419 3.9254 1.4970 2.4623 3.2998 3.0959 2.7923 2.9275 3.3359 4.3496 2.9429 2.7065 1.4985 1.7870 1.2283 1.5489 3.0626 2.8211 3.3809 3.0315 2.5492 3.8177 1.1215 4.1780 1.2260 4.3251 4.4938 5.7223 2.5953 10.3810 1.1825 1.8628 1.1078 1.1424 2.6241 2.1335 2.1583 6.5364 1.8857 1.8133 1.7681 2.2147 2.4864 3.1493 2.6735 2.4813 2.3333 2.7803 2.0333 1.9301 1.5246 1.5235 3.2325 2.9479 1.6524 1.4257 2.9216 1.1585 1.1707 1.6609 1.4007 1.2672 1.0657 1.3881 1.4192 1.4227 1.5969 1.6116 1.2225 1.2545 1.2628 2.8696 1.7098 2.8039 1.3133 1.0965 1.0777 1.0678 1.0495 1.0408 1.0413 1.0988 1.0682 1.0805 1.8962 1.0947 1.3143 4.7738 6.5774 1.0587 1.0598 1.0364 1.0613 1.0371 1.0370 1.0589 1.0594 1.0732 1.0853 1.1015 1.1035 1.1031 1.1036 1.1007 1.0993 1.0996 1.1012 1.1012 1.0983 1.0983 1.0770 1.0771
irintensity: 0.0502 0.0348 0.0528 0.6729 0.1102 5.7003 1.2392 0.6994 0.0259 0.3427 3.5287 0.0756 0.8587 0.8069 1.7108 1.8627 0.0115 1.3446 0.3043 0.7845 1.9892 6.1998 0.1480 6.3107 6.7641 15.3325 159.6632 18.6285 6.8789 4.6073 9.4151 0.0112 8.5207 11.4416 0.0882 4.0197 9.9389 2.3904 5.3144 1.7515 5.8041 11.0719 6.0694 0.9720 6.1940 4.5841 0.9260 1.9853 1.9726 0.6799 2.8609 16.0025 3.8373 0.1167 1.5195 17.8127 18.8048 7.0054 3.3177 0.8774 1.6201 3.4865 1.7930 3.4951 2.9852 12.0335 26.1322 96.9764 0.8843 13.9155 13.9654 41.0635 41.5454 117.4251 40.4213 3.0256 28.0054 12.8949 2.6932 4.8548 8.9494 11.0649 14.3683 54.8921 84.9768 11.3478 268.1216 79.4012 35.0477 1492.6448 86.2742 1.2075 30.3467 37.2199 78.1413 36.3589 32.7760 29.8705 27.8301 24.5347 10.3036 9.4795 11.1995 9.3196 45.6360 80.6873 59.4825 42.6247 41.1861 67.8335 37.5283 29.8949 30.6402 74.5428
temp: 298.150 k
press: 1.00000 atm
elementType: 7 7 7 7 7 6 6 6 6 6 6 6 6 6 6 6 6 1 1 1 1 1 1 1 1 1 1 1 1 1 1 1 1 1 1 1 1 1 1 1
symmnumber: 1
zpe: 910234.3 jmol-1
zpe.correction: 0.346690 hartree
zpe.thermalcorrener: 0.365796 hartree
zpe.thermalcorrenthalpy: 0.366741 hartree
zpe.thermalcorrgfe: 0.296661 hartree
zpe.sumelectzpe: -743.522659 hartree
zpe.sumelectthermal: -743.503552 hartree
zpe.sumelectthermalent: -743.502608 hartree
zpe.sumelectthermalfe: -743.572688 hartree
dipole: 1.2197 1.0687 -1.1033
dipole: 1.9614
quadrupole: -94.1254 -91.8504 -105.0030
quadrupole: -5.8228 -3.2199 -2.8196
quadrupole: 2.8676 5.1425 -8.0101 -5.8228 -3.2199 -2.8196
hfenergy: -743.8693486 hartree
pointgroup: C01 [X(C12H23N5)]
dipole: -0.458038 0.4640961 -0.4126747 debye
polarizability: 188.604258|22.363257|200.1006085|18.648321|-2.854522|132.3315648 unknown
InChI: InChI=1S/C12H23N5/c1-4-7-8-9-10-15-11(13-5-2)17-12(16-10)14-6-3/h13-14H,4-9H2,1-3H3
charge 0 multiplicity 1
40 atoms
N  0.69284 1.098911 0.935331
N  -0.973124 -0.63612 0.589854
N  0.315113 3.219269 -0.019242
N  -2.88698 -0.1192 -0.683185
N  -1.315597 1.584297 -0.382747
C  1.479533 -2.381332 1.087933
C  2.459943 -2.040958 -0.056215
C  1.036185 -1.140897 1.910582
C  2.89122 -3.283497 -0.867817
C  0.207311 -0.167888 1.099812
C  3.878806 -2.946777 -2.006045
C  -0.115435 1.934806 0.182073
C  -1.693928 0.285071 -0.144693
C  1.574996 3.756502 0.52066
C  -3.442056 -1.473212 -0.525082
C  1.7719 5.2105 0.060543
C  -4.800751 -1.575269 -1.237718
H  0.574835 -2.867086 0.673876
H  1.956158 -3.109281 1.775301
H  1.990578 -1.303831 -0.739101
H  3.359921 -1.544454 0.363102
H  1.914265 -0.599367 2.302982
H  0.423863 -1.481875 2.767773
H  3.353509 -4.024738 -0.183561
H  1.989093 -3.771699 -1.290228
H  3.431419 -2.227281 -2.71786
H  4.1680 -3.850092 -2.574698
H  4.80294 -2.488709 -1.605215
H  -0.299495 3.817716 -0.573009
H  -3.397549 0.583066 -1.220377
H  1.560872 3.69557 1.625784
H  2.416913 3.121988 0.185973
H  -2.729847 -2.215058 -0.934332
H  -3.546759 -1.70482 0.551772
H  1.821482 5.279271 -1.042031
H  0.949311 5.859573 0.414805
H  2.716164 5.612151 0.466797
H  -5.530358 -0.860035 -0.814548
H  -4.7024 -1.37486 -2.320916
H  -5.216092 -2.590856 -1.119234
