program: Gaussian 09
title: 000033508
version: EM64L-G09RevD.01
frameworkgroup: C1[X(C16H19N3O5)]
method: RPBEPBE
basis: SDD
operation: Freq
keyword: #p
keyword: freq=noraman
keyword: PBEPBE/SDD
title: #p freq=noraman PBEPBE/SDD
converged: YES YES NO NO
title: Mulliken charges:
elementType: O O O O O N N N C C C C C C C C C C C C C C C C H H H H H H H H H H H H H H H H H H H
charge: -0.272588 -0.267557 -0.239040 -0.258765 -0.248243 -0.363655 -0.232497 -0.647487 -0.325007 0.338391 -0.210937 -0.379910 -0.209293 0.174167 0.184802 -0.335583 -0.121642 -0.233851 -0.533825 0.279785 0.224242 -0.848954 0.302851 -0.763101 0.286886 0.264089 0.269761 0.272631 0.224456 0.295738 0.268025 0.272313 0.208954 0.232133 0.238930 0.221405 0.286559 0.219716 0.333343 0.359231 0.243757 0.243004 0.246766
chargesum: 0.00000
title: Mulliken charges with hydrogens summed into heavy atoms:
elementType: O O O O O N N N C C C C C C C C C C C C C C C C
charge: -0.272588 -0.267557 -0.239040 -0.258765 -0.248243 -0.093894 -0.232497 0.045087 -0.038121 0.338391 0.053152 0.117178 0.086445 0.174167 0.184802 0.204755 -0.121642 -0.233851 0.146192 0.279785 0.224242 -0.121274 0.302851 -0.029573
polarizability: 2.47588976e+02 -1.53905956e+01 2.62470292e+02 2.36602235e+00 9.58130261e+00 1.42500802e+02
1716.lowfreq: -5.2683 -2.2696 -0.0009 -0.0007 -0.0006 8.0242 18.7768 33.3004 40.9040
frequency: 18.7617 33.2886 40.8963 49.8251 62.0818 69.3965 87.9905 100.4116 126.5942 135.1896 149.2553 155.1872 164.7369 177.0363 185.0491 202.1127 214.3861 238.5704 256.2923 279.1548 284.9317 310.4897 329.2998 350.1110 380.9628 387.9563 408.1697 415.4666 423.9171 455.5590 469.9019 496.4595 507.8955 528.9065 567.2995 574.1926 599.6545 622.4048 642.3786 686.3358 693.1670 703.6142 717.6969 743.8450 759.3373 773.9018 791.2554 811.7188 841.4872 855.4042 884.4866 899.6678 927.7356 941.1386 955.7090 963.8402 978.9423 1002.5397 1009.2231 1023.9419 1035.2286 1041.4266 1044.4745 1059.5980 1079.5622 1088.5424 1106.4199 1110.7403 1129.0721 1152.3943 1161.4638 1171.6553 1175.7370 1190.2397 1200.6606 1202.7235 1217.2110 1251.5139 1301.7115 1318.3287 1322.7252 1336.8811 1354.0389 1362.2143 1371.6849 1381.6337 1383.8716 1399.5784 1424.7812 1446.5058 1455.2806 1459.6293 1461.7856 1468.1091 1470.2015 1473.9538 1484.0037 1486.6004 1508.8202 1543.7991 1567.3053 1585.8143 1632.5092 1647.3188 2954.8286 2960.0008 2992.7188 3004.4059 3007.7273 3023.1898 3042.4353 3050.0420 3092.4147 3095.3059 3098.4863 3115.6805 3123.9049 3135.9110 3145.1898 3162.7417 3363.4481 3454.4739 3661.2655
redmass: 7.3454 5.4514 3.7641 3.9911 1.0990 4.3224 3.4320 4.7974 4.4117 4.0478 3.9865 1.1446 5.1561 2.8829 3.3803 1.6457 5.7496 4.1429 3.1444 3.3674 3.8768 3.4185 3.6836 2.7877 7.3540 5.2003 4.3778 4.0479 5.3200 2.2648 3.3857 6.6132 5.9201 3.4001 2.9791 3.3812 5.1349 4.4952 3.9234 5.4714 4.9068 1.1275 3.6687 10.5585 5.0521 4.5078 3.3904 7.7480 6.4719 1.2356 2.8115 4.0646 2.4291 5.2502 2.6606 1.9981 2.0794 1.9588 3.8835 3.2568 2.1673 1.4511 1.6495 1.7829 2.7628 1.7604 1.6166 1.3081 1.8985 1.5186 2.0125 1.9413 2.2135 2.0787 1.3710 2.6430 1.4619 1.3397 1.4150 2.8825 1.8541 2.0892 2.3131 1.8322 2.5395 1.2579 2.2454 2.5234 1.1563 3.8314 1.0633 1.0526 1.0541 1.1264 1.0902 1.2982 1.0589 1.0464 6.9309 3.0886 5.3176 2.9457 3.7304 9.9475 1.0390 1.0329 1.0821 1.0378 1.0658 1.0980 1.0594 1.1024 1.0948 1.0980 1.0945 1.0999 1.1063 1.1023 1.0898 1.0950 1.0777 1.0510 1.0967
irintensity: 0.7925 0.7947 3.1673 2.7029 0.3113 4.1231 3.4887 6.6900 0.8961 0.9849 1.2377 0.0188 1.8592 3.1850 3.8704 1.2302 1.6671 8.0854 18.1250 1.1196 0.7737 1.1713 7.2763 11.0364 22.1965 37.2404 17.2043 8.6110 5.5171 22.7270 16.9170 5.4190 4.9908 31.3382 25.0793 27.8116 18.4646 2.9196 22.0928 12.7678 5.3165 109.1186 8.8304 1.5687 15.9051 38.6445 26.8838 0.7839 20.6476 5.2406 49.1871 12.8288 4.8166 51.6537 16.5668 42.4167 13.6358 89.1969 122.4394 2.1536 69.6807 0.7671 8.8794 26.1174 34.6933 19.2519 28.9887 6.6326 10.9341 20.8481 11.4158 21.6856 7.8681 26.6455 10.7175 338.3206 69.5831 11.2206 4.3815 19.7461 15.5771 37.9899 33.7986 10.5369 16.1673 54.3085 31.1593 130.5828 19.8235 210.7129 16.6575 20.9618 8.9522 18.1107 12.3952 22.3986 13.9548 17.0687 194.0742 287.8683 319.3003 120.1182 72.4572 223.1307 51.5339 55.1483 2.7401 4.5075 39.0290 28.1205 2.4921 42.2930 1.5854 5.8687 10.5865 20.3968 4.0138 11.4640 12.6003 12.8300 5.0788 102.3134 63.9901
temp: 298.150 k
press: 1.00000 atm
elementType: 8 8 8 8 8 7 7 7 6 6 6 6 6 6 6 6 6 6 6 6 6 6 6 6 1 1 1 1 1 1 1 1 1 1 1 1 1 1 1 1 1 1 1
symmnumber: 1
zpe: 879369.4 jmol-1
zpe.correction: 0.334934 hartree
zpe.thermalcorrener: 0.358385 hartree
zpe.thermalcorrenthalpy: 0.359329 hartree
zpe.thermalcorrgfe: 0.281047 hartree
zpe.sumelectzpe: -1159.647254 hartree
zpe.sumelectthermal: -1159.623803 hartree
zpe.sumelectthermalent: -1159.622859 hartree
zpe.sumelectthermalfe: -1159.701141 hartree
dipole: -0.2958 4.4344 -1.5114
dipole: 4.6943
quadrupole: -124.8424 -130.6431 -140.6389
quadrupole: -33.5887 7.4492 1.3931
quadrupole: 7.1990 1.3984 -8.5974 -33.5887 7.4492 1.3931
hfenergy: -1159.9821878 hartree
pointgroup: C01 [X(C16H19N3O5)]
dipole: 0.1100801 -1.726013 -0.6478114 debye
polarizability: 247.5490485|-15.4670894|262.8358017|-4.6917998|-5.7663911|142.1752191 unknown
InChI: InChI=1S/C16H19N3O5/c1-6-11(17)14(22)10-8(5-24-7(2)20)16(23-3)15-9(18-15)4-19(16)12(10)13(6)21/h8-9,15,18H,4-5,17H2,1-3H3
charge 0 multiplicity 1
43 atoms
O  1.681445 -1.025751 1.320731
O  3.115362 1.081889 -0.475558
O  -3.299691 -1.860909 0.536943
O  -0.940513 3.022289 -0.551485
O  4.133848 2.444384 1.120042
N  0.832166 -2.297689 -2.178026
N  -0.425942 -1.602673 0.177769
N  -3.55157 2.954548 -0.05486
C  1.621281 -2.129529 -0.889362
C  0.985574 -1.090726 0.033949
C  0.658673 -3.297091 -1.041743
C  -0.60812 -3.017717 -0.225956
C  0.803525 0.381746 -0.470473
C  -1.313123 -0.553057 0.121211
C  -0.667629 0.650761 -0.149418
C  1.779662 1.397459 0.121653
C  -2.798211 -0.695462 0.322636
C  -1.415199 1.864636 -0.24299
C  1.641596 -2.242947 2.144782
C  -3.575161 0.531025 0.263079
C  -2.921258 1.742858 0.014359
C  -5.072442 0.462806 0.47449
C  4.221284 1.668811 0.141468
C  5.50811 1.216607 -0.519797
H  2.708595 -2.24185 -0.877859
H  1.010232 -4.326705 -1.157479
H  1.432643 -2.683111 -2.931309
H  -1.536154 -3.125616 -0.808613
H  -0.670552 -3.688668 0.6511
H  0.92779 0.379508 -1.571608
H  1.850328 1.329976 1.217367
H  1.490688 2.419762 -0.17561
H  2.097448 -3.110876 1.628506
H  0.603352 -2.486234 2.439012
H  2.230051 -1.999971 3.042522
H  -5.39464 1.048667 1.358911
H  -5.368238 -0.58565 0.640091
H  -5.634413 0.839489 -0.40393
H  -4.554141 3.057401 0.077179
H  -2.956756 3.761126 -0.27559
H  5.327831 0.872508 -1.549381
H  5.941343 0.381363 0.060559
H  6.235423 2.043615 -0.512912
