program: Gaussian 09
title: 000003145
version: EM64L-G09RevD.01
frameworkgroup: C1[X(C22H34O2)]
method: RPBEPBE
basis: SDD
operation: Freq
keyword: #pfreq=noraman
keyword: PBEPBE/SDD
title: #p freq=noraman PBEPBE/SDD
converged: YES YES NO NO
title: Mulliken charges:
elementType: O O C C C C C C C C C C C C C C C C C C C C C C H H H H H H H H H H H H H H H H H H H H H H H H H H H H H H H H H H
charge: -0.423759 -0.247924 -0.374164 -0.377778 -0.393401 -0.455814 -0.486148 -0.179909 -0.178006 0.212484 -0.530252 -0.158786 -0.157523 -0.532508 -0.160682 -0.531780 -0.162435 -0.564315 -0.168139 -0.164760 -0.130533 -0.406803 -0.212740 -0.703168 0.189179 0.202659 0.194463 0.218868 0.219190 0.217979 0.202116 0.195506 0.243963 0.270154 0.223712 0.220021 0.207850 0.205879 0.217442 0.220585 0.203739 0.207392 0.371997 0.218918 0.205650 0.207384 0.217522 0.212715 0.200613 0.222233 0.234658 0.243145 0.202897 0.239781 0.204459 0.214059 0.216525 0.215590
chargesum: 0.00000
title: Mulliken charges with hydrogens summed into heavy atoms:
elementType: O O C C C C C C C C C C C C C C C C C C C C C C
charge: -0.051763 -0.247924 0.017674 0.035553 0.043768 -0.058191 0.027969 0.043802 0.042015 0.212484 -0.116523 0.058656 0.063061 -0.121377 0.058236 -0.118746 0.055087 -0.150986 0.054094 0.069898 0.112612 0.035875 -0.008281 -0.056994
polarizability: 2.91928060e+02 1.67286316e+00 2.46240466e+02 -1.98796820e+01 8.10834881e+00 2.09519072e+02
1716.lowfreq: -9.6322 -7.9650 -4.9667 0.0004 0.0005 0.0005 11.2821 20.5465 23.5330
frequency: 10.9071 20.2747 23.1712 27.4842 35.9871 44.5383 47.2866 54.6114 56.5730 65.5813 67.0570 70.5870 89.4692 93.9100 106.2812 128.9691 129.6499 151.0588 166.2614 176.9985 181.5546 199.2030 206.8799 224.0681 229.7882 247.7198 257.0870 271.4206 285.3145 290.0691 327.9727 367.9973 393.1419 413.9850 419.8948 428.3468 454.1222 485.3969 495.2268 499.5981 512.9839 545.3219 586.7251 594.0393 627.3943 720.1663 726.5441 754.8172 767.4556 781.3870 791.0414 804.7600 817.0308 825.0036 855.1721 868.7811 889.0283 909.8414 915.9042 922.0666 931.1314 947.5849 958.8736 969.5593 971.6524 978.4822 986.7483 991.8281 1005.2832 1015.8011 1019.8935 1037.0635 1041.4540 1050.9682 1060.3832 1073.3145 1078.2535 1081.5953 1084.8304 1093.7571 1095.9257 1102.3398 1113.8869 1129.7583 1136.6829 1161.5816 1179.6524 1184.9703 1191.6464 1199.4900 1232.7296 1238.8694 1240.9825 1246.9841 1258.8626 1260.0503 1263.7510 1272.1462 1278.1549 1283.6212 1286.0356 1288.0040 1292.9231 1293.9426 1296.9467 1301.1873 1307.6509 1315.5649 1318.2762 1326.4662 1336.9166 1344.3267 1350.5707 1351.4642 1371.6760 1385.5678 1436.9826 1450.8395 1451.0974 1452.8799 1454.2294 1457.3860 1458.6207 1462.4581 1472.3299 1477.1081 1479.3852 1487.3754 1664.0145 1671.7428 1677.9103 1683.2559 1686.2606 1689.5848 2942.7557 2946.9757 2947.4352 2951.8413 2953.8418 2956.3048 2957.2270 2965.1504 2979.3220 2987.7969 2995.1035 2996.0862 3001.1391 3007.0701 3014.4995 3030.4114 3031.6937 3032.8800 3034.0663 3041.2072 3061.0165 3063.0256 3064.7361 3069.4856 3070.4219 3072.7268 3073.4033 3076.7150 3077.5635 3079.6554 3083.2568 3086.1363 3088.1580 3513.1452
redmass: 4.9633 4.9037 4.3043 4.5010 3.7117 3.9418 4.1690 6.0673 3.3905 2.1484 2.9075 3.5402 2.4706 2.6442 2.7505 1.9709 2.0249 2.2251 2.5936 3.9273 1.9043 2.5177 1.9666 2.6455 2.9262 2.6013 2.7608 1.9553 1.7942 3.0214 3.7458 3.4162 3.1896 2.5347 2.2709 3.1434 3.0698 2.4982 1.7712 2.2658 2.8705 3.0313 2.6248 3.9016 1.4260 1.2661 1.1916 1.3347 1.5481 1.6004 1.5805 1.6795 1.6164 1.4770 2.1754 3.2937 2.1287 2.1164 2.2278 2.1141 1.9077 2.0846 1.1774 1.1251 1.1367 1.1145 1.1616 1.8115 1.6298 1.7678 4.0359 3.8282 1.9617 1.7562 3.3712 2.1673 2.1213 2.0301 1.6601 2.3997 2.2257 2.5171 2.2427 2.0085 1.5360 1.7651 1.4530 1.3364 1.2826 1.2142 1.2896 1.2468 1.4362 1.2561 1.1618 1.2769 1.2548 1.2404 1.1717 1.2552 1.2453 1.1870 1.2132 1.2549 1.2344 1.2325 1.2986 1.3928 1.5347 1.4080 1.4203 1.4327 1.5488 1.5346 1.7473 1.2326 1.0831 1.0918 1.0880 1.0911 1.0954 1.0799 1.0807 1.0816 1.0865 1.0515 1.0885 1.0566 8.1285 6.5743 6.3518 6.2195 6.4901 6.6812 1.0649 1.0645 1.0644 1.0604 1.0585 1.0606 1.0602 1.0609 1.0353 1.0663 1.0677 1.0948 1.0892 1.0997 1.0968 1.0935 1.0936 1.0941 1.0991 1.1019 1.1013 1.0908 1.0938 1.0929 1.0919 1.0991 1.0914 1.0923 1.0994 1.0885 1.0878 1.0873 1.0893 1.0638
irintensity: 0.0487 0.0170 0.0155 0.2398 0.0828 0.5277 0.0540 1.2569 0.3729 0.1504 0.6947 0.0553 0.3171 0.1863 0.5804 0.5340 0.0066 0.1428 0.3672 1.8172 0.3927 0.3209 2.4875 0.3474 0.2674 1.6630 3.1100 3.7202 3.4156 0.1713 6.9709 6.3690 4.2914 6.2963 3.7553 9.1781 0.2213 5.8256 36.2603 2.2248 0.7692 3.0973 4.5488 21.3934 149.9888 2.7332 13.1574 12.4737 2.5515 2.1752 1.2781 9.5644 3.8325 5.2769 0.9026 2.4010 0.6129 6.4028 2.9692 9.7075 6.5381 37.2865 12.9141 22.6134 105.5940 79.4819 47.2952 7.9037 12.2956 16.8016 3.8360 13.4900 136.9648 36.5164 1.2532 6.9360 17.9587 13.7898 1.0815 1.8002 2.7050 7.7213 3.0314 17.9031 4.5463 1.8905 2.6232 2.8777 1.9981 0.1073 0.6203 0.1893 2.9365 0.8702 0.7900 3.7801 4.0419 0.5259 1.9963 1.2253 0.4598 2.5826 0.4363 0.9582 1.9449 1.1567 4.7606 4.4127 26.2073 0.3526 0.5326 0.4045 1.3306 3.5223 35.9943 9.8537 22.8315 16.9885 12.7884 13.0568 10.0327 19.0042 1.6642 0.1216 16.6983 4.5502 21.9783 7.6354 164.5330 4.8115 0.1685 0.2963 1.1079 0.8683 43.5228 21.8757 72.5986 20.4780 29.9546 1.1085 36.1614 104.3893 21.4651 7.1545 11.6768 11.3581 11.8457 20.4781 9.9325 21.4211 1.7652 2.2987 21.1288 60.4525 59.2423 28.1208 10.3365 1.3150 15.9366 43.8248 15.9040 25.5603 42.3990 17.9414 19.6142 156.3084 28.2231 17.3882
temp: 298.150 k
press: 1.00000 atm
elementType: 8 8 6 6 6 6 6 6 6 6 6 6 6 6 6 6 6 6 6 6 6 6 6 6 1 1 1 1 1 1 1 1 1 1 1 1 1 1 1 1 1 1 1 1 1 1 1 1 1 1 1 1 1 1 1 1 1 1
symmnumber: 1
zpe: 1315561.4 jmol-1
zpe.correction: 0.501071 hartree
zpe.thermalcorrener: 0.530703 hartree
zpe.thermalcorrenthalpy: 0.531647 hartree
zpe.thermalcorrgfe: 0.435024 hartree
zpe.sumelectzpe: -1007.221433 hartree
zpe.sumelectthermal: -1007.191801 hartree
zpe.sumelectthermalent: -1007.190857 hartree
zpe.sumelectthermalfe: -1007.287480 hartree
dipole: 0.8081 0.1850 -0.6557
dipole: 1.0570
quadrupole: -155.7427 -144.5562 -141.4641
quadrupole: 3.3828 2.1914 -1.6475
quadrupole: -8.4884 2.6982 5.7902 3.3828 2.1914 -1.6475
hfenergy: -1007.7225043 hartree
pointgroup: C01 [X(C22H34O2)]
dipole: 0.2966966 -0.1015039 0.2731235 debye
polarizability: 288.878172|-5.8632738|246.4465867|24.7897204|7.0633415|212.3628392 unknown
InChI: InChI=1S/C22H34O2/c1-2-3-4-5-6-7-8-9-10-11-12-13-14-15-16-17-18-19-20-21-22(23)24/h3-4,6-7,9-10,12-13,15-16,23H,2,5,8,11,14,17-21H2,1H3
charge 0 multiplicity 1
58 atoms
O  -4.08074 1.338333 1.857951
O  -5.143221 0.330922 0.057759
C  -2.42418 -3.167706 0.542552
C  -1.045837 -2.789863 -0.048598
C  -3.513535 -2.083085 0.363555
C  -0.014431 -3.946875 0.048383
C  -3.19971 -0.780989 1.128929
C  1.329743 -3.576858 -0.544018
C  2.500767 -3.534603 0.14239
C  -4.242499 0.297977 0.925339
C  3.84517 -3.125073 -0.440176
C  4.42762 -1.91392 0.273597
C  4.763185 -0.742241 -0.324055
C  5.314059 0.476825 0.40286
C  4.46271 1.715049 0.16199
C  2.835258 3.555952 0.862097
C  3.72464 2.346288 1.110146
C  -1.061522 3.05604 0.233162
C  1.360399 3.217751 1.027047
C  0.405257 3.428273 0.084596
C  -1.537191 2.131682 -0.878908
C  -3.174313 1.464078 -2.75209
C  -2.634044 2.356108 -1.650253
C  -2.31128 0.235163 -3.100927
H  -2.307139 -3.404324 1.621133
H  -2.774485 -4.101535 0.057162
H  -1.16993 -2.500635 -1.113477
H  -0.627271 -1.905469 0.470792
H  -4.488834 -2.476854 0.708608
H  -3.639854 -1.850606 -0.711213
H  0.111434 -4.240647 1.10956
H  -0.431471 -4.83091 -0.479736
H  -3.09294 -0.966325 2.214483
H  -2.234775 -0.350046 0.796895
H  1.328979 -3.301176 -1.611492
H  2.499104 -3.798085 1.212706
H  4.553815 -3.976597 -0.343883
H  3.74169 -2.913365 -1.52109
H  4.5598 -2.014061 1.36304
H  4.617151 -0.633774 -1.410565
H  5.379309 0.266941 1.487171
H  6.348596 0.675425 0.048478
H  -4.746745 2.052203 1.661745
H  4.437724 2.093772 -0.872405
H  3.014193 3.958304 -0.152754
H  3.10873 4.357751 1.581655
H  3.732729 1.953716 2.139762
H  -1.211559 2.570119 1.219652
H  -1.690432 3.97045 0.230546
H  1.073387 2.751831 1.983589
H  0.689694 3.881194 -0.878195
H  -0.920617 1.235413 -1.044499
H  -3.319854 2.080814 -3.664065
H  -4.190371 1.128564 -2.455235
H  -3.219522 3.271977 -1.461849
H  -2.202779 -0.438645 -2.230872
H  -1.297552 0.535594 -3.424286
H  -2.77461 -0.34494 -3.919388
