program: Gaussian 09
title: 000033409
version: EM64L-G09RevD.01
frameworkgroup: C1[X(C10H19N5)]
method: RPBEPBE
basis: SDD
operation: Freq
keyword: #pfreq=noraman
keyword: PBEPBE/SDD
title: #p freq=noraman PBEPBE/SDD
converged: NO YES NO NO
title: Mulliken charges:
elementType: N N N N N C C C C C C C C C C H H H H H H H H H H H H H H H H H H H
charge: -0.110570 -0.110589 -0.334843 -0.334797 -0.106054 -0.446788 -0.365952 0.056358 0.035615 0.035581 -0.684985 -0.301413 -0.301419 -0.717580 -0.717562 0.210877 0.211055 0.215792 0.215881 0.211436 0.211423 0.217336 0.325883 0.325875 0.228181 0.229950 0.228444 0.229674 0.222544 0.221349 0.227711 0.222511 0.221372 0.227704
chargesum: 0.00000
title: Mulliken charges with hydrogens summed into heavy atoms:
elementType: N N N N N C C C C C C C C C C
charge: -0.110570 -0.110589 -0.008960 -0.008923 -0.106054 -0.024855 0.065720 0.056358 0.035615 0.035581 -0.044790 0.156718 0.156698 -0.045976 -0.045974
polarizability: 1.85161774e+02 -3.56304308e-02 1.77758396e+02 -5.37315144e+00 -2.39327747e-01 9.56723585e+01
1716.lowfreq: -7.1607 -0.0008 0.0003 0.0005 3.1784 7.9991 23.2938 26.2733 31.4773
frequency: 23.1149 25.9649 31.3697 62.9871 79.0580 80.9301 85.7431 133.2921 149.0170 193.8641 200.6131 238.2509 251.8047 264.7612 283.6617 288.1261 290.7907 306.1674 339.0108 426.1403 509.9488 524.0919 529.1996 580.6754 651.1186 686.5348 716.9763 735.5510 748.5280 795.4247 796.2688 811.4885 871.6365 878.3867 895.1052 906.2925 912.4373 997.1055 1017.3264 1054.2121 1063.9753 1076.0380 1092.8039 1132.6703 1145.4169 1146.1862 1164.8915 1178.8797 1203.3376 1230.8432 1258.1210 1260.1105 1267.4211 1280.4711 1295.1560 1333.2043 1335.4689 1353.7650 1367.7724 1389.2020 1396.3246 1396.8317 1415.0322 1452.5026 1475.1958 1476.7718 1476.8336 1477.5623 1478.8989 1479.9403 1485.6656 1491.5843 1495.6090 1501.4375 1502.6492 1528.5570 1585.9003 2971.6258 2981.4805 2981.9294 2982.4341 2983.6243 2984.2591 3008.0887 3022.4763 3022.7518 3032.0400 3067.4182 3070.5091 3076.6020 3076.7722 3083.6693 3091.6602 3091.8260 3563.6822 3564.5109
redmass: 2.3537 3.0199 2.3859 2.8400 1.7140 3.2896 2.4018 3.2894 3.4766 3.6517 3.4715 1.1126 1.5202 1.3812 3.0347 3.0543 2.7177 3.0150 3.1622 4.9977 3.7692 1.1615 1.0893 4.7830 6.3905 6.2656 10.1196 5.1080 1.1223 1.1102 1.1089 9.9602 1.2908 2.2902 5.9808 2.6719 1.7264 2.8888 3.2901 2.8444 2.4510 1.9513 2.1326 2.7495 1.5257 1.5278 3.3277 3.0844 3.5476 1.4580 1.1008 1.1005 1.5000 1.1376 1.7845 1.5347 1.4481 1.9242 1.7119 1.2142 1.2403 1.2407 2.5241 1.1710 1.0836 1.0408 1.0413 1.0458 1.2520 1.0802 1.0765 1.9811 1.2293 1.0938 2.2486 5.5831 7.0735 1.0351 1.0506 1.0411 1.0450 1.0547 1.0596 1.0584 1.1033 1.1035 1.1009 1.1013 1.0992 1.1011 1.1011 1.1044 1.0985 1.0985 1.0770 1.0771
irintensity: 0.0083 0.2179 0.0192 3.8786 0.0085 0.6466 0.0117 7.9580 0.8993 2.6256 0.0055 0.0001 0.7497 0.0008 0.5428 0.6475 0.0321 0.0055 3.4935 14.6823 2.3365 171.3549 0.5118 12.3452 0.1602 9.6334 0.0019 12.6932 4.9871 3.0559 8.3191 20.2040 4.1943 1.6456 13.8312 3.3446 0.6688 0.4421 2.1206 0.2169 2.1037 4.0185 36.0375 7.9563 0.0052 3.6766 0.1367 40.5961 11.6311 1.6029 0.0271 0.2985 2.7642 3.5222 2.6116 11.9533 1.4388 77.0852 28.5771 7.3001 28.8889 33.3522 127.4796 3.8644 5.7394 0.3579 25.6332 8.7182 182.9644 35.4770 14.2459 138.5663 216.8037 1.3636 45.8953 1107.7184 372.4679 49.9526 19.1618 18.1955 47.4300 39.0351 13.8611 33.8883 0.3831 28.1485 1.0057 19.2955 48.1270 4.3448 99.7188 60.7826 1.5964 64.0370 112.8676 0.7021
temp: 298.150 k
press: 1.00000 atm
elementType: 7 7 7 7 7 6 6 6 6 6 6 6 6 6 6 1 1 1 1 1 1 1 1 1 1 1 1 1 1 1 1 1 1 1
symmnumber: 1
zpe: 763955.4 jmol-1
zpe.correction: 0.290975 hartree
zpe.thermalcorrener: 0.308238 hartree
zpe.thermalcorrenthalpy: 0.309182 hartree
zpe.thermalcorrgfe: 0.243280 hartree
zpe.sumelectzpe: -665.077834 hartree
zpe.sumelectthermal: -665.060572 hartree
zpe.sumelectthermalent: -665.059628 hartree
zpe.sumelectthermalfe: -665.125529 hartree
dipole: -2.6859 0.0018 0.6078
dipole: 2.7538
quadrupole: -84.1260 -77.1257 -92.9631
quadrupole: -0.0067 -0.2129 -0.0911
quadrupole: 0.6123 7.6125 -8.2248 -0.0067 -0.2129 -0.0911
hfenergy: -665.3688097 hartree
pointgroup: C01 [X(C10H19N5)]
dipole: 1.0569869 -0.0018513 -0.2378192 debye
polarizability: 185.1748663|0.0156706|177.7584948|-5.2634776|0.212194|95.6591682 unknown
InChI: InChI=1S/C10H19N5/c1-4-7-8-13-9(11-5-2)15-10(14-8)12-6-3/h11-12H,4-7H2,1-3H3
charge 0 multiplicity 1
34 atoms
N  -0.887229 -1.21315 0.353563
N  -0.881483 1.213523 0.36225
N  1.126589 -2.353763 0.030366
N  1.137676 2.34684 0.046797
N  1.221722 -0.003613 0.024672
C  -3.004522 0.004123 0.651938
C  -3.760151 0.008949 -0.706161
C  -1.507623 0.001307 0.457517
C  0.478428 -1.152498 0.135999
C  0.483893 1.147935 0.144263
C  -5.291999 0.007938 -0.518704
C  2.571864 -2.490043 -0.197185
C  2.584132 2.47783 -0.176205
C  2.970619 -3.975372 -0.232915
C  2.980341 3.961673 -0.26362
H  -3.28984 -0.896582 1.224915
H  -3.285769 0.903299 1.229294
H  -3.450441 0.901318 -1.284163
H  -3.450185 -0.879086 -1.290651
H  -5.623573 -0.888899 0.038109
H  -5.623693 0.898449 0.048129
H  -5.813162 0.013444 -1.493957
H  0.536769 -3.182665 0.119397
H  0.552727 3.177831 0.147734
H  2.845628 -1.990568 -1.14702
H  3.121458 -1.957473 0.602822
H  3.132282 1.976296 0.645185
H  2.862184 1.944326 -1.105571
H  2.73124 -4.477633 0.722841
H  2.450796 -4.5111 -1.049083
H  4.056807 -4.072465 -0.403412
H  2.464051 4.465679 -1.101747
H  2.734846 4.49856 0.671722
H  4.067418 4.054689 -0.43072
