program: Gaussian 09
title: 000033413
version: EM64L-G09RevD.01
frameworkgroup: C1[X(C14H27N5)]
method: RPBEPBE
basis: SDD
operation: Freq
keyword: #pfreq=noraman
keyword: PBEPBE/SDD
title: #p freq=noraman PBEPBE/SDD
converged: YES YES NO NO
title: Mulliken charges:
elementType: N N N N N C C C C C C C C C C C C C C H H H H H H H H H H H H H H H H H H H H H H H H H H H
charge: -0.349159 -0.348325 -0.135203 -0.113492 -0.113787 -0.031484 -0.028801 -0.370853 -0.373803 -0.689379 -0.698625 -0.689053 -0.698693 0.058634 0.059438 -0.450453 0.055241 -0.366551 -0.685124 0.188008 0.188082 0.239782 0.210706 0.210805 0.239493 0.207104 0.209658 0.233191 0.208454 0.218256 0.211073 0.207467 0.209239 0.232647 0.208411 0.218217 0.210805 0.311058 0.311136 0.212498 0.210535 0.216704 0.215144 0.211512 0.211674 0.217814
chargesum: 0.00000
title: Mulliken charges with hydrogens summed into heavy atoms:
elementType: N N N N N C C C C C C C C C C C C C C
charge: -0.038101 -0.037189 -0.135203 -0.113492 -0.113787 0.156524 0.159280 0.079635 0.076494 -0.039425 -0.060842 -0.039701 -0.061259 0.058634 0.059438 -0.027420 0.055241 0.065297 -0.044125
polarizability: 2.36064306e+02 2.18133830e+00 2.13130146e+02 5.38611550e+00 -1.58438310e+01 1.45159369e+02
1716.lowfreq: -6.3617 -5.2991 -2.6167 -0.0004 0.0003 0.0006 16.7481 19.2016 28.2134
frequency: 16.4466 18.8417 28.0953 30.0903 35.1070 48.0169 56.5940 79.3321 97.7436 140.3847 162.1206 173.4968 193.5166 197.9903 218.7282 228.0979 233.2659 235.6627 250.9791 257.1202 263.6957 275.7035 295.3326 321.3993 354.2319 396.6782 407.6927 411.5885 419.0963 520.8819 556.9562 570.8989 603.5690 609.5116 634.6167 657.7561 711.6028 722.2404 746.1900 807.2474 810.5370 813.1622 866.6100 882.1993 897.7250 900.2597 903.7679 913.9962 916.0446 932.1005 933.8748 960.3163 961.8719 965.7338 1009.5734 1053.4771 1069.5811 1090.6965 1106.6857 1132.4301 1134.7354 1146.8338 1161.1232 1167.6069 1179.2919 1179.7958 1205.3549 1229.5257 1241.9047 1258.4835 1274.3454 1280.7641 1291.7428 1294.7913 1322.6236 1335.7301 1336.9168 1340.8669 1345.0705 1352.4490 1364.9696 1376.4226 1377.9766 1385.9058 1394.9522 1395.9115 1414.0948 1452.1167 1458.0318 1459.8750 1466.5003 1467.5909 1470.8323 1471.8462 1475.0033 1475.6857 1479.9265 1480.7507 1484.9087 1486.9842 1487.2353 1495.9854 1513.3757 1535.3411 1588.2168 2950.9147 2952.7539 2966.1242 2968.5958 2969.6169 2971.3925 2971.9997 2976.2312 2976.7115 2985.5358 3009.6055 3033.7274 3060.2451 3060.4042 3067.3979 3067.6898 3068.2758 3071.8844 3072.2192 3072.6200 3075.9159 3076.3960 3080.4042 3080.6426 3085.5970 3550.3199 3551.9902
redmass: 3.1312 2.9479 3.2571 3.2823 3.4397 2.8511 2.6986 1.7798 4.1705 3.2630 6.3152 3.5159 1.0787 1.0783 1.6025 1.1725 1.8572 1.2107 2.2200 2.8782 2.6453 3.5559 3.5046 3.1580 2.3158 2.8010 1.8654 1.8674 2.9595 2.9831 3.1265 4.4304 1.2736 1.2658 4.4024 4.1534 10.7551 6.5615 1.1189 4.9054 2.6584 3.7954 1.3187 2.1775 1.4455 4.7330 1.6563 1.2507 1.2839 1.7898 1.7318 1.5433 1.5686 3.3340 2.5733 2.9294 1.9189 2.1605 2.0020 2.3089 2.2475 3.0701 2.7786 2.2480 1.8150 1.8081 4.0187 1.4576 1.5112 1.2744 1.3126 1.1408 1.2950 1.3093 1.7619 1.5226 1.4596 1.5240 1.5040 1.5712 1.7886 1.2149 1.2177 1.2139 1.2560 1.2294 2.6731 1.1664 1.0850 1.0991 1.0473 1.0524 1.0916 1.0881 1.0581 1.0465 1.0549 1.0530 1.0780 1.0730 1.0565 2.4973 2.6135 5.3583 5.2515 1.0835 1.0835 1.0610 1.0418 1.0408 1.0571 1.0363 1.0367 1.0378 1.0596 1.0584 1.1010 1.0993 1.0994 1.0981 1.1015 1.0986 1.0992 1.0983 1.0983 1.0976 1.0975 1.0990 1.0989 1.1045 1.0761 1.0762
irintensity: 0.0130 0.1468 0.1200 0.0877 0.3707 0.2395 0.5086 0.0296 0.1313 0.4739 6.0966 0.4186 0.2443 0.1586 1.5739 0.1153 0.2418 0.1868 0.0746 0.7120 1.0034 0.2784 1.1105 0.8940 0.0623 1.1645 0.5196 1.0140 0.5485 18.0738 24.1510 14.5297 93.3623 77.4869 0.4720 21.0628 0.7244 20.1990 4.0520 6.1966 0.6342 25.4695 7.4790 2.3357 3.3442 12.1063 13.6961 5.9832 7.3792 8.2089 9.7646 2.4477 3.0548 2.0112 6.1741 0.2449 14.9887 40.9570 10.7769 9.8773 8.2238 5.9186 29.8600 71.8578 3.5219 2.7752 34.2771 0.4092 4.8518 52.3263 7.8033 0.8017 7.3801 1.7726 4.9395 7.3910 28.6230 7.6707 9.6790 8.8185 1.7847 13.6009 10.9839 7.6366 53.9888 22.1468 213.1050 6.5079 45.1307 6.4941 2.3910 4.6646 37.1640 35.4520 6.1372 8.0037 34.6732 15.9988 13.8163 16.2753 62.5932 211.8949 40.4434 1208.8249 357.9673 29.9518 28.5847 34.8924 10.0675 81.1479 116.7227 30.8650 20.1580 14.2696 13.9385 34.2688 0.8856 36.9749 19.2675 17.9793 21.3005 15.0332 44.7684 22.0981 28.3992 114.6904 26.9644 21.4134 64.3273 59.7875 68.6214 24.6812
temp: 298.150 k
press: 1.00000 atm
elementType: 7 7 7 7 7 6 6 6 6 6 6 6 6 6 6 6 6 6 6 1 1 1 1 1 1 1 1 1 1 1 1 1 1 1 1 1 1 1 1 1 1 1 1 1 1 1
symmnumber: 1
zpe: 1055254.5 jmol-1
zpe.correction: 0.401925 hartree
zpe.thermalcorrener: 0.424608 hartree
zpe.thermalcorrenthalpy: 0.425553 hartree
zpe.thermalcorrgfe: 0.346294 hartree
zpe.sumelectzpe: -821.973884 hartree
zpe.sumelectthermal: -821.951201 hartree
zpe.sumelectthermalent: -821.950256 hartree
zpe.sumelectthermalfe: -822.029515 hartree
dipole: 2.3671 0.4504 0.4468
dipole: 2.4506
quadrupole: -115.6946 -105.3895 -118.1469
quadrupole: -1.7361 -0.1259 -4.3720
quadrupole: -2.6176 7.6875 -5.0699 -1.7361 -0.1259 -4.3720
hfenergy: -822.3758089 hartree
pointgroup: C01 [X(C14H27N5)]
dipole: -0.5676858 -0.7620318 0.1631639 debye
polarizability: 221.195931|13.7886535|223.6944116|-19.4452609|13.2098012|149.4634779 unknown
InChI: InChI=1S/C14H27N5/c1-6-7-12-17-13(15-8-10(2)3)19-14(18-12)16-9-11(4)5/h10-11,15-16H,6-9H2,1-5H3
charge 0 multiplicity 1
46 atoms
N  -1.836358 1.217222 0.965768
N  1.310184 -1.577668 -1.183772
N  -0.324084 -0.256407 -0.099926
N  1.799376 0.681128 -0.87683
N  0.180748 2.117425 0.220933
C  -4.205424 0.505874 0.462655
C  1.190839 -3.908273 -0.212982
C  -2.870104 0.203031 1.197795
C  0.538816 -2.823611 -1.115387
C  -4.017307 0.509025 -1.070476
C  -5.280202 -0.516171 0.900342
C  1.276181 -3.441543 1.256905
C  0.401825 -5.231726 -0.343703
C  -0.632183 1.002349 0.343484
C  0.903282 -0.359757 -0.699485
C  2.327811 3.056841 -0.528439
C  1.378894 1.890233 -0.396674
C  3.308696 3.139425 0.675971
C  4.286155 4.32606 0.545148
H  -4.545007 1.517666 0.775183
H  2.223958 -4.084773 -0.584523
H  -2.457466 -0.75956 0.850053
H  -3.065851 0.117104 2.286764
H  0.410443 -3.230866 -2.139497
H  -0.460138 -2.561201 -0.726399
H  -3.720583 -0.495171 -1.428443
H  -4.954876 0.792645 -1.58344
H  -3.229529 1.221023 -1.375132
H  -4.975448 -1.545588 0.629895
H  -6.245071 -0.310562 0.402274
H  -5.448822 -0.487696 1.993613
H  0.263544 -3.289578 1.676265
H  1.797817 -4.190882 1.880628
H  1.821218 -2.484427 1.340476
H  -0.642832 -5.100808 -0.001007
H  0.85957 -6.026221 0.273231
H  0.373651 -5.588171 -1.390919
H  -1.99029 2.181139 1.268826
H  2.235622 -1.573268 -1.617482
H  1.739306 3.989796 -0.584839
H  2.909276 2.939459 -1.460601
H  3.872444 2.188902 0.742104
H  2.721258 3.233881 1.609756
H  4.897482 4.237589 -0.372689
H  3.740193 5.286937 0.494722
H  4.975586 4.372973 1.408156
