program: Gaussian 09
title: 000033672
version: EM64L-G09RevD.01
frameworkgroup: C1[X(C23H22N2O6S)]
method: RPBEPBE
basis: SDD
operation: Freq
keyword: #p
keyword: freq=noraman
keyword: PBEPBE/SDD
title: #p freq=noraman PBEPBE/SDD
converged: YES YES NO NO
title: Mulliken charges:
elementType: S O O O O O O N N C C C C C C C C C C C C C C C C C C C C C C C H H H H H H H H H H H H H H H H H H H H H H
charge: 0.199574 -0.190138 -0.414373 -0.195405 -0.220407 -0.354761 -0.157722 -0.105923 -0.356834 -0.463311 -0.144763 -0.090009 -0.177634 0.118041 -0.689969 -0.654762 0.154219 0.236294 -0.560419 0.499577 0.213499 -0.445407 -0.307719 -0.230822 -0.252184 -0.238620 0.427262 -0.388971 -0.343392 -0.204215 -0.204291 -0.239533 0.315880 0.291588 0.314965 0.230685 0.240940 0.244034 0.253114 0.242212 0.223823 0.356596 0.280527 0.388713 0.224878 0.250107 0.225451 0.226376 0.227459 0.298880 0.247817 0.236342 0.231213 0.231516
chargesum: 0.00000
title: Mulliken charges with hydrogens summed into heavy atoms:
elementType: S O O O O O O N N C C C C C C C C C C C C C C C C C C C C C C C
charge: 0.199574 -0.190138 -0.025660 -0.195405 -0.220407 -0.354761 -0.157722 -0.105923 -0.000238 -0.147431 -0.144763 0.201579 0.137331 0.118041 0.025690 0.064386 0.154219 0.236294 -0.279892 0.499577 0.213499 -0.220529 -0.057612 -0.005371 -0.025808 -0.011161 0.427262 -0.090090 -0.095575 0.032128 0.026922 -0.008017
polarizability: 3.57678325e+02 -3.94998509e+01 2.92339313e+02 4.20570891e+00 -1.41957912e+00 2.34088151e+02
1716.lowfreq: -13.0196 -5.7263 -1.2004 -0.0012 -0.0012 0.0011 5.6590 21.2684 24.9134
frequency: -8.5210 21.1690 24.8875 31.8046 36.8597 39.1001 49.6906 51.4950 52.9077 58.8183 63.3452 71.0780 98.2039 106.6635 128.7532 139.9870 154.9573 195.8346 202.5326 213.2234 227.2972 242.8443 253.7650 255.8508 272.1148 274.5262 286.9303 297.1080 318.1385 338.1789 359.5438 366.8369 396.1773 404.1292 411.4131 432.4998 478.6450 484.5165 485.9951 495.9150 526.0429 529.5709 560.8534 577.7468 583.8903 600.4272 610.2994 618.2712 623.4112 631.9838 642.5842 659.7658 686.8018 692.0644 697.1119 700.5079 702.3401 740.2488 767.0298 774.5510 785.2425 792.8910 832.3033 843.5286 845.1653 846.2101 852.7785 894.8366 903.2532 912.6265 926.9258 933.0695 938.7395 942.0621 962.9948 969.8447 977.5780 985.1969 991.7352 994.1251 994.5347 999.1201 1009.0633 1020.1901 1024.7363 1030.2516 1033.3869 1066.8369 1080.5966 1085.5977 1125.9232 1137.1786 1151.5980 1153.5427 1165.9707 1172.0839 1173.0323 1182.2620 1192.0111 1194.4986 1195.5329 1208.8687 1216.5632 1219.0501 1236.7964 1249.0824 1277.9809 1282.1812 1296.9392 1312.5583 1323.7789 1342.3516 1360.8741 1383.8814 1384.4956 1387.4678 1403.0154 1441.5378 1444.3367 1459.6005 1464.0944 1472.1962 1479.1863 1480.9637 1486.3765 1491.2277 1596.8752 1598.0145 1606.1920 1616.9197 1638.3977 1680.9459 1688.8287 1721.4699 2981.9155 2986.7347 3020.7516 3024.4445 3053.6295 3076.7160 3084.2068 3095.1113 3104.4953 3106.3653 3111.3730 3128.4908 3133.0696 3142.5715 3143.2211 3152.2199 3159.4884 3163.2194 3173.6420 3178.6918 3493.5635 3514.3545
redmass: 5.5952 7.0152 5.8800 5.2903 5.1419 5.8447 7.7233 5.1156 6.1265 8.4742 6.6765 6.2365 7.3022 8.6629 6.4354 6.5437 7.5634 6.9332 4.3320 5.6613 3.6154 2.7737 2.6287 1.7072 5.4550 5.9817 3.0439 1.2070 7.3109 4.1057 4.7743 3.9451 6.6069 2.7792 2.9022 5.3468 4.4303 4.2040 3.7681 5.7656 4.2297 5.5092 3.9181 5.4261 3.1312 5.9996 6.6580 4.3794 2.0304 1.7761 3.2888 5.4030 4.4659 3.9513 2.7295 3.3541 1.5329 2.2832 5.4621 5.0727 3.0288 3.1366 4.6684 1.9512 1.3113 1.9194 5.5409 2.5813 4.9801 3.8455 1.5377 2.1522 2.1737 1.6070 3.5738 1.4080 1.3694 5.9446 6.2692 1.4181 2.9360 1.3380 1.4656 2.2104 4.5584 2.3474 2.8593 2.7801 1.5343 1.6181 1.7784 2.2712 2.8353 1.7291 2.1930 1.0654 1.0610 1.1710 1.6692 1.1430 2.1861 1.6294 1.3795 1.4946 2.4453 1.7603 2.5441 1.8220 2.0858 1.3087 1.7351 1.3371 1.5431 9.8943 1.1952 7.6178 1.1944 2.2219 2.1619 1.0499 1.0469 2.2086 1.0501 1.0509 2.1916 1.8059 6.1051 6.1068 6.8501 6.1326 7.3902 9.1070 10.5302 12.6531 1.0380 1.0360 1.0826 1.0843 1.0839 1.0969 1.0991 1.1009 1.0932 1.0978 1.0881 1.0870 1.0853 1.0895 1.0928 1.0941 1.0985 1.0971 1.1013 1.0972 1.0783 1.0642
irintensity: 0.4841 0.1589 0.5264 1.1557 0.6721 1.1243 0.8060 1.6738 2.1607 2.2421 0.6256 0.1871 3.1653 1.8249 5.4317 0.9840 6.9604 9.0794 1.9487 3.9987 0.9669 0.2120 3.2851 0.5660 5.4734 0.2676 0.6177 0.1403 4.3095 0.0490 6.8292 25.9908 5.5270 0.1304 0.0902 5.9587 9.2052 3.3161 20.8423 13.0982 22.9628 12.3307 58.8800 6.8811 41.9531 11.9524 0.7678 12.0260 13.0823 151.7581 3.3537 4.9031 9.3536 53.1995 14.2908 12.5981 74.4832 52.2353 5.3728 14.9448 9.0773 39.5993 10.1775 6.3323 2.0594 11.0497 1.2413 23.8004 55.1918 61.7922 4.8658 8.4738 1.8873 2.2480 33.8929 0.4515 1.9608 37.2187 3.2687 1.1399 2.4943 1.7621 5.3209 23.3917 210.2091 5.3002 342.1195 202.9895 14.2563 7.5762 85.7492 49.5442 94.9157 20.9674 7.8045 2.2354 0.2009 6.0335 25.2857 5.3225 36.2545 14.0227 63.0029 35.2149 101.9404 4.2576 184.0818 85.2894 36.4237 0.5151 9.6031 9.7561 22.5324 1.1454 29.3417 1.3261 16.4583 8.7146 11.8587 0.9056 7.1105 60.9097 14.1475 5.5204 130.4464 291.0183 3.0538 25.2427 4.7968 1.1126 177.2169 208.2788 206.9589 445.4229 19.3453 17.2294 10.3382 4.6539 26.6669 12.7177 15.2207 13.8904 10.1552 17.3135 10.3820 2.0045 0.9554 23.3353 29.3069 4.8333 42.5666 18.8032 17.6967 2.9777 57.8919 36.8693
temp: 298.150 k
press: 1.00000 atm
elementType: 16 8 8 8 8 8 8 7 7 6 6 6 6 6 6 6 6 6 6 6 6 6 6 6 6 6 6 6 6 6 6 6 1 1 1 1 1 1 1 1 1 1 1 1 1 1 1 1 1 1 1 1 1 1
symmnumber: 1
zpe: 1072748.9 jmol-1
zpe.correction: 0.408588 hartree
zpe.thermalcorrener: 0.437831 hartree
zpe.thermalcorrenthalpy: 0.438776 hartree
zpe.thermalcorrgfe: 0.345470 hartree
zpe.sumelectzpe: -1846.254088 hartree
zpe.sumelectthermal: -1846.224845 hartree
zpe.sumelectthermalent: -1846.223901 hartree
zpe.sumelectthermalfe: -1846.317206 hartree
dipole: -5.0107 1.1791 4.9783
dipole: 7.1611
quadrupole: -165.2977 -187.4980 -196.2155
quadrupole: -4.3049 0.6870 -2.9404
quadrupole: 17.7060 -4.4943 -13.2117 -4.3049 0.6870 -2.9404
hfenergy: -1846.6626762 hartree
pointgroup: C01 [X(C23H22N2O6S1)]
dipole: -1.5766302 1.2202639 1.9906916 debye
polarizability: 320.0735424|-51.0609247|330.0004619|1.398597|-2.8810935|234.0317846 unknown
InChI: InChI=1S/C23H22N2O6S/c1-23(2)17(21(28)29)25-19(27)16(20(25)32-23)24-18(26)15(13-9-5-3-6-10-13)22(30)31-14-11-7-4-8-12-14/h3-12,15-17,20,24,28H,1-2H3
charge 0 multiplicity 1
54 atoms
S  -2.763757 -0.244133 1.80235
O  -1.38796 1.70298 -1.739066
O  -5.9502 2.920945 -0.326947
O  -6.01239 0.895023 -1.472767
O  0.535623 -2.663284 -1.372077
O  2.06751 0.708696 0.6055
O  3.717707 -0.224117 -0.788022
N  -3.234282 0.493345 -0.717525
N  -0.245453 -0.865665 -0.110541
C  -2.857911 -0.76769 -0.021453
C  -4.25865 0.976363 1.491399
C  -4.070083 1.469758 -0.019316
C  -1.494564 -0.749938 -0.816289
C  -1.934182 0.699427 -1.247674
C  -4.136158 2.153789 2.47385
C  -5.56693 0.184086 1.70306
C  -5.421593 1.677633 -0.70773
C  0.716997 -1.801733 -0.472773
C  2.037537 -1.676801 0.365946
C  2.929967 -2.900972 0.263674
C  2.745462 -0.370632 -0.036216
C  3.216292 -3.646332 1.433536
C  3.479093 -3.317064 -0.974195
C  4.040671 -4.792606 1.373578
C  4.302907 -4.460984 -1.034577
C  4.586724 -5.202366 0.136347
C  2.488976 2.063019 0.333692
C  1.661898 2.864329 -0.476536
C  3.661924 2.554763 0.937524
C  2.030165 4.214927 -0.677999
C  4.016422 3.905444 0.722638
C  3.201643 4.736804 -0.081461
H  -3.52931 -1.625658 -0.155731
H  -3.545419 2.443626 -0.015569
H  -1.488122 -1.474449 -1.648986
H  -4.250874 1.809157 3.51644
H  -3.158856 2.657962 2.378924
H  -4.93236 2.892606 2.266752
H  -5.66543 -0.654307 0.992197
H  -5.589304 -0.228233 2.725201
H  -6.4463 0.8458 1.582312
H  0.010913 -0.143041 0.570301
H  1.721921 -1.5366 1.416743
H  -6.832755 3.057584 -0.767352
H  2.793163 -3.332298 2.396464
H  3.260721 -2.75139 -1.883748
H  4.253708 -5.360602 2.285984
H  4.722547 -4.775787 -1.996343
H  5.226489 -6.09062 0.084221
H  0.763034 2.448208 -0.944507
H  4.281315 1.896439 1.5544
H  1.400135 4.852939 -1.306835
H  4.927193 4.304444 1.181903
H  3.480487 5.783305 -0.2451
