program: Gaussian 09
title: 000033390
version: EM64L-G09RevD.01
frameworkgroup: C1[X(C8H12Cl3N5)]
method: RPBEPBE
basis: SDD
operation: Freq
keyword: #p
keyword: freq=noraman
keyword: PBEPBE/SDD
title: #p freq=noraman PBEPBE/SDD
converged: NO YES NO NO
title: Mulliken charges:
elementType: Cl Cl Cl N N N N N C C C C C C C C H H H H H H H H H H H H
charge: 0.089907 0.116947 0.089951 -0.334373 -0.329046 -0.113418 -0.061416 -0.034345 -0.304243 -0.303710 0.056913 0.035485 0.298702 -0.717340 -0.716743 -0.744120 0.239033 0.240926 0.238512 0.240503 0.327945 0.328550 0.222365 0.220943 0.234162 0.222638 0.221138 0.234135
chargesum: 0.00000
title: Mulliken charges with hydrogens summed into heavy atoms:
elementType: Cl Cl Cl N N N N N C C C C C C C C
charge: 0.089907 0.116947 0.089951 -0.006428 -0.000496 -0.113418 -0.061416 -0.034345 0.175716 0.175305 0.056913 0.035485 0.298702 -0.039870 -0.038832 -0.744120
polarizability: 2.15785520e+02 1.84354915e+00 1.57327497e+02 -3.42290158e-01 -1.39905969e-02 1.06456651e+02
1716.lowfreq: -40.6776 -6.4268 -0.0029 -0.0027 -0.0017 2.1906 6.4716 9.9675 30.5493
frequency: -40.0363 7.0391 30.1687 70.3499 77.7351 84.6892 87.3745 130.0030 161.3444 174.8766 212.5671 217.8570 220.5371 226.3395 262.4699 270.4780 291.1291 293.9258 297.9556 360.2811 387.7052 389.5102 519.1259 538.5001 554.7799 617.9719 640.4435 663.9516 714.3367 744.3698 750.3128 764.5300 792.4931 794.8569 812.5709 890.0792 892.0613 923.5803 1007.7525 1026.8942 1064.3437 1087.8681 1144.0700 1144.7840 1145.4929 1168.7604 1247.5659 1262.1549 1262.8253 1264.4419 1339.6466 1344.1104 1373.3438 1396.3163 1400.4328 1418.4479 1453.0280 1477.7083 1478.2758 1478.8543 1479.9713 1488.1544 1497.7048 1500.2276 1554.0577 1596.3109 2982.1396 2983.2613 2996.7086 2997.2562 3038.5368 3039.0241 3078.4125 3079.3416 3093.6142 3094.3401 3559.6040 3562.0517
redmass: 2.1633 14.0468 2.2427 2.4881 5.6298 3.7431 9.8945 2.7241 10.8843 5.0906 2.7663 8.7184 8.6968 7.7811 1.2490 1.6726 5.6537 10.3896 3.8841 6.3141 6.3885 6.3957 5.4877 1.1328 1.1517 12.4942 8.5408 7.9086 9.7619 10.0466 9.8533 6.3521 1.1172 1.1221 11.8169 5.0559 2.9992 1.9752 3.5776 5.7173 2.6866 3.2560 1.5519 1.6009 2.8520 2.8810 2.7731 2.3323 1.5903 1.1057 1.4207 1.8576 2.3053 1.2417 1.2434 1.5682 7.7795 1.2089 1.0417 1.0463 1.0519 1.7585 1.0871 1.1618 5.7359 7.2365 1.0369 1.0371 1.0594 1.0596 1.1034 1.1034 1.1016 1.1016 1.0982 1.0983 1.0771 1.0772
irintensity: 0.1878 0.0041 0.0266 6.0473 0.2428 1.7560 0.2701 0.0692 0.7938 0.2837 0.2745 0.9586 1.0921 0.1551 0.0156 1.3661 0.8852 0.0507 0.3666 0.7329 0.4862 1.8778 24.0190 8.1095 207.1301 50.5218 44.9359 23.1257 0.4489 105.4499 131.5391 50.1406 0.9509 1.4788 0.2459 6.9930 5.1511 4.5965 27.2027 2.3303 0.0416 5.9886 2.0593 2.2028 0.3984 22.6816 6.9701 2.4997 0.7417 0.1292 108.8671 21.4444 132.5284 30.3513 25.9701 19.1937 4.9410 69.1056 14.5370 17.6780 82.9818 199.3335 57.0436 1.8012 1569.2036 132.5454 31.7426 31.9692 20.5506 21.0896 5.4433 4.6252 48.1838 54.8071 29.0870 28.0684 55.3086 77.6164
temp: 298.150 k
press: 1.00000 atm
elementType: 17 17 17 7 7 7 7 7 6 6 6 6 6 6 6 6 1 1 1 1 1 1 1 1 1 1 1 1
symmnumber: 1
zpe: 541167.5 jmol-1
zpe.correction: 0.206120 hartree
zpe.thermalcorrener: 0.223233 hartree
zpe.thermalcorrenthalpy: 0.224177 hartree
zpe.thermalcorrgfe: 0.157980 hartree
zpe.sumelectzpe: -1964.775778 hartree
zpe.sumelectthermal: -1964.758665 hartree
zpe.sumelectthermalent: -1964.757721 hartree
zpe.sumelectthermalfe: -1964.823918 hartree
dipole: 0.4507 -5.4522 -0.0017
dipole: 5.4708
quadrupole: -92.2876 -110.9109 -116.4021
quadrupole: 0.9935 -0.0598 -0.0033
quadrupole: 14.2460 -4.3774 -9.8686 0.9935 -0.0598 -0.0033
hfenergy: -1964.9818979 hartree
pointgroup: C01 [X(C8H12Cl3N5)]
dipole: 0.0736169 2.1511053 0.0006642 debye
polarizability: 215.8272831|0.9819866|157.2858833|0.3177681|0.0023959|106.4565017 unknown
InChI: InChI=1S/C8H12Cl3N5/c1-3-12-6-14-5(8(9,10)11)15-7(16-6)13-4-2/h12-13H,3-4H2,1-2H3
charge 0 multiplicity 1
28 atoms
Cl -0.908777 -3.098218 -1.522044
Cl 1.684135 -3.243289 0.010598
Cl -0.926368 -3.098931 1.512862
N  -2.341047 1.686894 -0.006646
N  2.341737 1.717057 0.008524
N  -0.000558 1.766184 0.000889
N  1.228643 -0.353031 0.006307
N  -1.198239 -0.367114 -0.003975
C  -3.65808 1.022016 -0.013967
C  3.665395 1.067154 0.01687
C  -1.15268 1.016801 -0.003253
C  1.160121 1.035091 0.005115
C  0.020511 -0.959099 0.001096
C  -4.78141 2.070789 0.018139
C  4.778186 2.127482 -0.017525
C  -0.006455 -2.496888 0.000918
H  -3.741543 0.3842 -0.91401
H  -3.72794 0.343153 0.856187
H  3.756814 0.431714 0.917888
H  3.743197 0.387166 -0.851774
H  -2.283873 2.706748 -0.007946
H  2.272885 2.736388 0.009558
H  -4.726364 2.692357 0.931199
H  -4.737165 2.736828 -0.863823
H  -5.764237 1.569005 0.011179
H  4.716611 2.746647 -0.931768
H  4.727445 2.794801 0.863105
H  5.765653 1.634996 -0.009802
