program: Gaussian 09
title: 000033381
version: EM64L-G09RevD.01
frameworkgroup: C1[X(C12H23N5)]
method: RPBEPBE
basis: SDD
operation: Freq
keyword: #pfreq=noraman
keyword: PBEPBE/SDD
title: #p freq=noraman PBEPBE/SDD
converged: YES YES NO NO
title: Mulliken charges:
elementType: N N N N N C C C C C C C C C C C C H H H H H H H H H H H H H H H H H H H H H H H
charge: -0.359076 -0.359169 -0.125530 -0.114537 -0.115074 0.004937 0.005088 -0.400510 -0.400627 -0.699152 -0.699003 0.053994 0.054141 -0.681514 -0.681552 0.065574 -0.755024 0.228590 0.228400 0.206425 0.190479 0.190534 0.206438 0.313599 0.313544 0.207542 0.202871 0.244332 0.207408 0.202876 0.244489 0.225030 0.215149 0.213577 0.224944 0.215185 0.213531 0.235622 0.238433 0.238036
chargesum: 0.00000
title: Mulliken charges with hydrogens summed into heavy atoms:
elementType: N N N N N C C C C C C C C C C C C
charge: -0.045476 -0.045625 -0.125530 -0.114537 -0.115074 0.233527 0.233489 -0.003606 -0.003654 -0.044408 -0.044231 0.053994 0.054141 -0.027758 -0.027892 0.065574 -0.042933
polarizability: 2.05200747e+02 -1.89429428e-01 1.89873428e+02 7.17914858e+00 7.13073646e-01 1.27193577e+02
1716.lowfreq: -36.1617 -9.4333 -6.7944 0.0005 0.0006 0.0008 2.6577 23.6212 28.9901
frequency: -36.1528 23.3810 28.9372 38.0644 57.7631 64.7635 106.1260 106.7595 135.5348 163.4406 167.3978 187.3698 195.4468 199.3735 216.5215 217.2481 234.8509 240.4393 300.4434 334.8723 363.4057 373.7723 387.5107 429.5639 478.6661 491.4387 519.5162 548.0014 558.0621 567.1461 613.5301 649.3924 704.5083 715.2220 773.0629 775.9298 798.6316 825.8234 833.3473 896.5314 903.1790 918.3890 962.0699 967.3239 984.9855 987.0321 1002.5957 1022.3099 1038.0600 1050.0575 1052.1781 1108.7172 1113.6932 1113.9154 1161.2878 1167.2814 1169.6577 1176.1651 1206.8257 1244.8490 1260.7199 1291.0979 1293.8858 1303.4942 1329.5381 1340.5604 1342.7623 1357.5341 1360.9946 1379.4884 1379.9104 1387.9060 1389.6662 1390.0768 1416.4588 1454.1344 1455.7921 1461.1328 1461.3898 1468.8945 1471.6338 1472.7202 1473.1963 1478.5512 1478.9107 1485.8673 1485.9532 1492.2483 1506.4609 1524.0798 1580.2627 2962.4062 2962.5463 2977.3944 2977.5628 2980.3562 2980.3717 2994.2591 3016.5262 3016.8359 3033.0358 3033.1519 3073.3529 3073.5268 3076.7856 3077.1152 3080.1590 3080.4788 3084.9036 3091.5238 3091.7019 3129.2004 3545.5383 3546.3474
redmass: 1.0131 3.0037 3.1512 3.5369 3.3396 3.4856 2.0274 1.8847 2.7135 3.4369 4.1069 3.6136 1.9934 2.4829 1.2438 1.2389 1.2272 1.3646 2.7546 3.3631 2.6435 2.8482 2.8752 3.3792 3.0161 2.6999 2.9541 4.6005 1.3604 1.1286 3.0358 6.5057 3.2516 11.5684 1.2429 1.4718 9.7345 1.8114 1.8602 10.6461 2.5532 1.9661 1.3906 1.2080 1.8954 1.7369 1.4997 1.9346 3.2548 2.1901 1.8344 3.3305 2.3882 2.3808 2.0483 2.3840 2.1780 2.4667 3.4371 1.5086 1.4324 1.2802 1.2456 1.6906 1.5306 1.7164 1.7673 1.4134 1.4976 1.2192 1.2178 1.2789 1.2117 1.2301 2.5266 1.1255 1.1218 1.0734 1.0600 1.1315 1.1370 1.0469 1.0444 1.0520 1.0462 1.0773 1.0628 2.6264 2.1764 7.1042 6.5777 1.0648 1.0648 1.0360 1.0359 1.0362 1.0362 1.0401 1.0844 1.0845 1.0957 1.0957 1.1000 1.1000 1.0995 1.0994 1.0997 1.0997 1.0920 1.0999 1.0999 1.1018 1.0764 1.0765
irintensity: 0.0608 0.0079 0.0001 0.0029 1.4847 0.1262 2.0146 0.0377 2.2403 0.0418 4.6071 0.4040 0.1875 0.4226 0.6801 0.1881 0.2700 0.4903 0.5903 2.6460 0.0883 0.5313 0.4990 7.1864 0.9344 0.7672 5.2239 17.3989 160.0364 2.3812 46.4579 1.4842 6.8679 0.0011 1.4475 12.5330 26.3704 0.1435 0.0726 12.2676 0.9662 0.0414 0.1228 30.7670 0.8290 10.2515 36.3522 10.6740 4.0844 10.8166 4.2902 9.7955 24.0636 7.1910 6.7138 8.3851 20.9159 44.1495 7.5895 0.3487 9.3384 9.0001 7.1145 0.6691 0.5749 0.0803 3.9511 20.2823 22.2723 6.6747 29.6026 10.4136 35.0376 8.7393 166.9692 12.6751 21.0979 4.4686 6.1906 124.5566 43.6501 13.5946 18.6692 2.3307 21.6167 25.6458 33.5413 225.9031 149.6680 1235.3198 348.4718 40.6334 27.7318 59.2281 17.9077 47.6666 1.4958 11.1924 7.2201 9.5932 3.7720 25.1078 7.8778 9.0717 91.0958 36.3407 20.9924 124.7670 16.2968 53.2337 15.0012 11.7073 93.7014 1.9744
temp: 298.150 k
press: 1.00000 atm
elementType: 7 7 7 7 7 6 6 6 6 6 6 6 6 6 6 6 6 1 1 1 1 1 1 1 1 1 1 1 1 1 1 1 1 1 1 1 1 1 1 1
symmnumber: 1
zpe: 906367.2 jmol-1
zpe.correction: 0.345217 hartree
zpe.thermalcorrener: 0.364541 hartree
zpe.thermalcorrenthalpy: 0.365485 hartree
zpe.thermalcorrgfe: 0.296142 hartree
zpe.sumelectzpe: -743.532107 hartree
zpe.sumelectthermal: -743.512783 hartree
zpe.sumelectthermalent: -743.511839 hartree
zpe.sumelectthermalfe: -743.581182 hartree
dipole: -0.0110 -2.7346 0.0861
dipole: 2.7360
quadrupole: -91.7864 -103.9795 -106.0791
quadrupole: -0.0493 2.4775 0.3196
quadrupole: 8.8285 -3.3645 -5.4641 -0.0493 2.4775 0.3196
hfenergy: -743.8773243 hartree
pointgroup: C01 [X(C12H23N5)]
dipole: 0.0010257 -1.07597 -0.0306745 debye
polarizability: 204.6691848|0.1791183|189.8672628|9.6317711|-0.9206555|127.7313039 unknown
InChI: InChI=1S/C12H23N5/c1-6-8(3)13-11-15-10(5)16-12(17-11)14-9(4)7-2/h8-9,13-14H,6-7H2,1-5H3
charge 0 multiplicity 1
40 atoms
N  -2.311701 0.107233 -0.45916
N  2.307767 0.08423 0.47037
N  -0.002639 0.002025 0.006662
N  1.195932 2.125645 0.25425
N  -1.181459 2.137607 -0.234036
C  -2.470853 -1.35884 -0.543659
C  2.452983 -1.383418 0.550676
C  -3.908955 -1.746978 -0.123206
C  3.887169 -1.784142 0.128393
C  -2.119368 -1.874951 -1.960402
C  2.09709 -1.900379 1.96601
C  -1.126859 0.753272 -0.224885
C  1.12889 0.742111 0.238777
C  -4.231963 -1.432914 1.353238
C  4.212578 -1.468414 -1.347165
C  0.010469 2.760792 0.009553
C  0.02441 4.267962 -0.019646
H  -1.748538 -1.793262 0.17261
H  1.726368 -1.809075 -0.166572
H  -4.036263 -2.830377 -0.311137
H  -4.6327 -1.232307 -0.790681
H  4.616173 -1.278712 0.797195
H  4.004012 -2.869323 0.312736
H  -3.106131 0.717766 -0.662737
H  3.108093 0.686765 0.674635
H  -2.168957 -2.979259 -1.995262
H  -2.822692 -1.473165 -2.713807
H  -1.09644 -1.564738 -2.23469
H  2.136078 -3.005208 1.99747
H  2.8045 -1.50764 2.720356
H  1.077296 -1.58108 2.241498
H  -4.093159 -0.359521 1.57646
H  -5.275737 -1.700551 1.599014
H  -3.567284 -2.000729 2.030588
H  4.084265 -0.392959 -1.566682
H  5.253537 -1.745517 -1.594364
H  3.541974 -2.027388 -2.026031
H  0.256832 4.622289 -1.041904
H  -0.964664 4.664428 0.258352
H  0.803244 4.656318 0.655383
