program: Gaussian 09
title: 000033372
version: EM64L-G09RevD.01
frameworkgroup: C1[X(C13H17NO3)]
method: RPBEPBE
basis: SDD
operation: Freq
keyword: #p
keyword: freq=noraman
keyword: PBEPBE/SDD
title: #p freq=noraman PBEPBE/SDD
converged: YES YES NO NO
title: Mulliken charges:
elementType: O O O N C C C C C C C C C C C C C H H H H H H H H H H H H H H H H H
charge: -0.259557 -0.353519 -0.375652 -0.351477 0.307576 0.214577 -0.253979 -0.394666 0.519666 -0.575077 -0.358884 -0.404546 -0.788033 -0.676801 -0.265638 -0.359266 0.294254 0.203908 0.203778 0.219359 0.219419 0.241516 0.247171 0.221864 0.239214 0.239163 0.218066 0.210595 0.229613 0.210619 0.268408 0.206964 0.323988 0.377375
chargesum: 0.00000
title: Mulliken charges with hydrogens summed into heavy atoms:
elementType: O O O N C C C C C C C C C C C C C
charge: -0.259557 -0.353519 0.001723 -0.027489 0.307576 0.214577 0.153707 0.044112 0.519666 -0.333561 -0.111713 -0.182682 -0.091590 -0.025974 0.002770 -0.152302 0.294254
polarizability: 3.54389444e+02 -2.06603455e+01 1.64058612e+02 1.29261545e-01 1.39518495e-01 8.21577574e+01
1716.lowfreq: -4.9826 -4.1723 -0.0010 -0.0004 0.0007 3.7140 28.2394 35.0853 49.1102
frequency: 28.1035 34.7071 49.1091 66.7534 77.6307 95.5937 95.8127 106.8181 146.3443 169.0524 180.3967 186.7906 219.9145 227.3395 235.2194 246.6324 295.7332 309.0783 320.5274 385.3054 387.1857 445.8340 461.4223 511.5232 541.9633 551.1719 572.7659 580.9198 685.1684 710.4618 744.3692 762.9902 768.1929 798.1844 809.5762 852.0764 895.5061 902.4223 902.6462 935.1915 938.5656 965.2495 977.9965 996.4049 998.1883 1024.8742 1049.7170 1052.8284 1124.9609 1135.8279 1140.4021 1169.7126 1195.1775 1221.1258 1230.5576 1244.8371 1280.7492 1286.7737 1303.2795 1308.2339 1311.4865 1362.6354 1374.7316 1389.6186 1398.2192 1401.9085 1418.6201 1456.5722 1469.3350 1471.6864 1475.4925 1479.7300 1482.3777 1489.2549 1503.6471 1561.0871 1578.8024 1615.9792 1640.9778 2949.9134 2980.0798 2984.6541 3005.9305 3009.1744 3054.5221 3062.9221 3082.6630 3086.1525 3094.2783 3102.0228 3114.2025 3120.8362 3136.3689 3156.5280 3164.3550 3622.1306
redmass: 4.2032 5.1381 5.1946 4.2372 1.8390 3.1738 2.9246 1.3029 2.5594 3.4972 5.6247 3.0954 6.0439 1.1497 2.9698 2.7180 4.2749 5.3571 1.5600 3.5276 3.1989 2.8991 4.6729 5.2842 1.2805 4.3655 2.2779 6.0342 3.4589 6.8328 3.3871 5.6801 1.0883 4.7466 1.4658 1.7993 1.1474 1.4435 1.7726 3.3679 1.3788 5.4180 6.6417 1.6625 1.2168 4.4385 1.5392 2.8000 2.1537 2.1821 1.4399 1.5103 1.3809 1.9402 1.2666 2.6591 1.4237 1.1033 1.7992 1.4638 1.4548 2.3380 1.6112 2.6975 1.2518 1.3303 2.6831 1.0454 1.9890 1.3350 1.2309 1.1037 1.0411 1.1164 2.1701 2.5299 7.2890 5.7900 5.6090 1.0551 1.0364 1.0365 1.0601 1.1064 1.1017 1.0968 1.1031 1.0988 1.1004 1.0916 1.0886 1.0913 1.0875 1.0624 1.0949 1.0827
irintensity: 0.0771 5.2911 0.1832 0.7838 1.0982 3.2795 3.8834 3.1962 13.7410 0.6422 0.0670 38.5335 4.0322 0.0045 1.1653 5.2199 18.8614 15.1527 71.2762 4.0843 12.1130 3.5175 10.5208 14.9237 130.3976 7.5706 35.8213 24.7237 9.6153 2.6949 0.0377 11.9533 14.5094 3.1672 41.4581 34.3305 2.3730 1.1282 11.3599 7.9359 0.7847 102.4158 110.1873 2.9626 46.2510 173.9555 10.1072 8.1363 152.9703 17.8349 0.3124 4.7651 0.1182 60.8461 0.2740 362.1001 39.6471 0.0028 2.1149 106.0024 55.2120 60.1588 2.2084 108.8652 44.0974 13.5304 35.9808 13.7621 178.0650 18.3454 7.6419 1.4150 13.9783 53.4632 94.1432 88.0009 16.1518 155.5379 114.5349 35.3638 39.0354 28.7143 23.7348 24.6402 0.0794 16.0467 81.4400 43.2481 16.7722 0.7354 14.1056 17.2639 9.1551 35.0011 16.4295 93.5532
temp: 298.150 k
press: 1.00000 atm
elementType: 8 8 8 7 6 6 6 6 6 6 6 6 6 6 6 6 6 1 1 1 1 1 1 1 1 1 1 1 1 1 1 1 1 1
symmnumber: 1
zpe: 721053.9 jmol-1
zpe.correction: 0.274635 hartree
zpe.thermalcorrener: 0.293196 hartree
zpe.thermalcorrenthalpy: 0.294140 hartree
zpe.thermalcorrgfe: 0.226285 hartree
zpe.sumelectzpe: -784.675197 hartree
zpe.sumelectthermal: -784.656636 hartree
zpe.sumelectthermalent: -784.655692 hartree
zpe.sumelectthermalfe: -784.723547 hartree
dipole: -6.0466 -3.4165 -0.0028
dipole: 6.9450
quadrupole: -114.3276 -90.5198 -105.5450
quadrupole: -3.4768 -0.0405 0.0391
quadrupole: -10.8635 12.9443 -2.0809 -3.4768 -0.0405 0.0391
hfenergy: -784.9498321 hartree
pointgroup: C01 [X(C13H17N1O3)]
dipole: 2.3723812 1.3555041 0.0184242 debye
polarizability: 354.2841116|-19.5201587|163.6952231|9.3319874|-4.1253676|82.6264784 unknown
InChI: InChI=1S/C13H17NO3/c1-3-8-17-12-6-4-11(9-10(12)2)5-7-13(15)14-16/h4-7,9,14,16H,3,8H2,1-2H3
charge 0 multiplicity 1
34 atoms
O  3.505469 -0.291434 0.262747
O  -5.095058 -0.906129 0.02044
O  -6.819784 1.054769 -0.110719
N  -5.41558 1.344863 -0.08452
C  1.450781 -1.508119 0.248398
C  2.107112 -0.240265 0.21366
C  4.256353 0.980557 0.235053
C  5.744272 0.629965 0.306391
C  -0.737048 -0.325794 0.125306
C  0.044573 -1.518102 0.203262
C  1.359224 0.963673 0.134566
C  -0.045248 0.916334 0.091172
C  2.265008 -2.7820 0.331338
C  6.625888 1.898156 0.280886
C  -2.195776 -0.443281 0.085792
C  -3.117385 0.568831 0.015758
C  -4.555122 0.265053 -0.013634
H  3.953748 1.607436 1.09974
H  4.022013 1.528509 -0.701451
H  5.931671 0.051479 1.230008
H  5.997244 -0.030059 -0.543999
H  -0.473565 -2.485164 0.229827
H  1.864423 1.933325 0.106179
H  -0.603606 1.856914 0.029941
H  2.95699 -2.868349 -0.526354
H  2.895222 -2.792974 1.239486
H  1.610284 -3.669567 0.346363
H  6.403602 2.561471 1.13776
H  7.695623 1.630238 0.333231
H  6.470312 2.479153 -0.64749
H  -2.609423 -1.46192 0.116772
H  -2.818037 1.624653 -0.019477
H  -5.21995 2.342656 -0.119951
H  -6.78253 0.037623 -0.066979
