program: Gaussian 09
title: 000033385
version: EM64L-G09RevD.01
frameworkgroup: C1[X(C12H23N5)]
method: RPBEPBE
basis: SDD
operation: Freq
keyword: #pfreq=noraman
keyword: PBEPBE/SDD
title: #p freq=noraman PBEPBE/SDD
converged: YES YES NO NO
title: Mulliken charges:
elementType: N N N N N C C C C C C C C C C C C H H H H H H H H H H H H H H H H H H H H H H H
charge: -0.122988 -0.123125 -0.133751 -0.117081 -0.118848 -0.352340 -0.352983 -0.351910 -0.353270 0.098782 0.099423 -0.667115 -0.667122 -0.667193 -0.666956 0.047373 -0.754390 0.259266 0.202512 0.249114 0.205918 0.258432 0.202573 0.248832 0.205956 0.205969 0.248358 0.211910 0.210272 0.243356 0.211172 0.205913 0.248741 0.211797 0.210286 0.243590 0.211019 0.236410 0.234697 0.237401
chargesum: 0.00000
title: Mulliken charges with hydrogens summed into heavy atoms:
elementType: N N N N N C C C C C C C C C C C C
charge: -0.122988 -0.123125 -0.133751 -0.117081 -0.118848 0.109438 0.102049 0.109095 0.101517 0.098782 0.099423 -0.000878 -0.002322 -0.000742 -0.002060 0.047373 -0.045882
polarizability: 2.29334667e+02 -1.76218556e-01 1.84687496e+02 8.25048043e-01 6.64513136e-01 1.17482488e+02
1716.lowfreq: -32.8272 -5.2230 -3.1456 0.0002 0.0006 0.0007 10.9759 38.8808 40.4437
frequency: -32.7833 38.8140 40.2412 44.9189 54.8651 58.6477 61.5400 91.2626 105.0327 150.1050 177.4380 180.6391 199.4173 205.0433 214.6394 215.4005 240.6527 250.4587 296.1669 305.9316 330.6525 341.7612 398.2985 400.8266 486.9674 515.0195 531.6794 550.9894 574.7071 603.9395 612.3318 712.2527 757.4547 772.9530 773.1534 776.2661 793.3163 799.4719 853.6683 896.6947 929.1442 930.0114 966.7211 982.2707 1010.9511 1044.9068 1051.3935 1071.9683 1075.6720 1076.2304 1082.8766 1084.4538 1097.0414 1097.8318 1180.4160 1183.3182 1209.8849 1222.1150 1247.5783 1291.0037 1297.4090 1311.5441 1313.9116 1347.7517 1348.7893 1352.8429 1362.6485 1364.7790 1377.4673 1377.8051 1382.3016 1382.6032 1391.1437 1436.4704 1439.7376 1449.7050 1452.5537 1454.0279 1456.0566 1464.3774 1465.4873 1466.7404 1467.6531 1468.2860 1481.7062 1482.0619 1482.9125 1483.6116 1484.5718 1528.0059 1573.4639 2981.3306 2981.4574 2981.5043 2981.6715 2993.6291 2998.6422 2998.7470 3004.5132 3005.2829 3065.9470 3066.2355 3068.5867 3068.6582 3081.8157 3082.3831 3084.0489 3086.7015 3086.8327 3097.8411 3098.0364 3101.3431 3101.4069 3127.8504
redmass: 1.0131 2.6639 2.7959 3.0246 2.9003 2.7124 2.7792 3.4386 4.0694 1.8633 7.6573 2.7400 5.5870 1.8269 1.0496 1.0503 1.2243 1.5841 3.0030 2.7840 2.3556 2.1575 2.4365 3.3431 3.7970 3.1652 3.4615 3.3309 4.1238 3.9965 3.7671 10.5756 2.0498 1.2240 1.2814 1.1708 6.7889 1.5735 2.4002 11.8954 2.0856 2.1898 2.2597 3.2158 2.0012 2.7646 1.7073 2.1911 2.0066 2.0110 1.8299 1.8822 1.8029 1.7700 3.0373 2.5427 2.7191 2.6976 3.2187 1.3464 1.5907 1.4913 1.3035 1.2361 1.2408 3.0090 1.3114 1.2955 1.2148 1.2204 1.2160 1.2218 1.4628 1.7603 2.0217 1.1381 1.1433 1.1096 1.1205 1.3811 1.0458 1.2205 1.0462 1.0773 1.1189 1.0532 1.2505 1.0601 1.2739 3.6464 4.9825 1.0355 1.0356 1.0356 1.0355 1.0398 1.0643 1.0643 1.0643 1.0643 1.0993 1.0992 1.0990 1.0990 1.0982 1.0982 1.0922 1.0968 1.0968 1.1020 1.1020 1.1021 1.1021 1.1017
irintensity: 0.0549 0.2115 0.0171 0.0069 0.4303 0.0061 0.2466 5.0092 0.0140 1.7051 0.0122 0.5337 0.8850 0.2021 0.4133 0.5128 0.3147 0.5818 0.2694 0.3422 1.1707 0.2446 11.8389 7.8129 9.4958 1.0125 0.1417 2.4354 10.1268 3.5583 5.3280 0.1938 20.1666 6.0718 5.0480 9.6594 13.6070 24.5094 2.2564 8.6518 0.9035 7.3174 10.6929 3.0142 32.5730 6.1193 7.1206 0.5526 18.2009 6.7873 12.1255 67.8716 5.1672 16.4237 37.1545 10.5831 20.8999 5.3046 57.3727 7.5422 115.8499 14.4592 6.8205 1.9925 4.4898 11.2072 70.4934 18.6213 17.5098 7.1130 54.4541 9.8979 26.6490 12.2978 277.1965 152.2611 124.7121 10.2385 3.2093 117.8105 4.2171 47.3921 6.1330 38.9575 14.9253 4.6399 4.4448 9.8616 9.6699 1400.8785 123.5957 32.9749 55.5498 25.4174 18.1375 12.3007 28.9515 38.1025 109.7290 30.7232 3.3039 14.2422 15.3759 15.9372 13.2123 70.5723 16.8621 53.2802 15.6459 22.9194 24.2315 40.8910 37.1330 13.0827
temp: 298.150 k
press: 1.00000 atm
elementType: 7 7 7 7 7 6 6 6 6 6 6 6 6 6 6 6 6 1 1 1 1 1 1 1 1 1 1 1 1 1 1 1 1 1 1 1 1 1 1 1
symmnumber: 1
zpe: 906424.2 jmol-1
zpe.correction: 0.345239 hartree
zpe.thermalcorrener: 0.364607 hartree
zpe.thermalcorrenthalpy: 0.365551 hartree
zpe.thermalcorrgfe: 0.296341 hartree
zpe.sumelectzpe: -743.513504 hartree
zpe.sumelectthermal: -743.494135 hartree
zpe.sumelectthermalent: -743.493191 hartree
zpe.sumelectthermalfe: -743.562402 hartree
dipole: -0.0010 -2.1562 0.0811
dipole: 2.1577
quadrupole: -91.2839 -100.9224 -105.8432
quadrupole: -0.0165 1.1209 0.2543
quadrupole: 8.0659 -1.5726 -6.4933 -0.0165 1.1209 0.2543
hfenergy: -743.8587426 hartree
pointgroup: C01 [X(C12H23N5)]
dipole: -0.0012579 0.8483505 0.0304719 debye
polarizability: 229.3352782|-0.0913805|184.6845714|-0.8169525|-0.7782802|117.4848011 unknown
InChI: InChI=1S/C12H23N5/c1-6-16(7-2)11-13-10(5)14-12(15-11)17(8-3)9-4/h6-9H2,1-5H3
charge 0 multiplicity 1
40 atoms
N  -2.354302 0.49116 0.135775
N  2.348915 0.506679 -0.141539
N  -0.002921 0.554901 -0.003735
N  1.216357 -1.56366 -0.07119
N  -1.209069 -1.571677 0.050837
C  -3.635235 -0.24412 0.231184
C  -2.389279 1.96908 0.119389
C  3.634391 -0.220185 -0.241363
C  2.373998 1.984779 -0.117611
C  -1.157912 -0.185184 0.061384
C  1.156788 -0.177821 -0.071822
C  -4.256687 -0.538302 -1.151131
C  -2.30269 2.582485 1.534192
C  4.253149 -0.526933 1.139379
C  2.280055 2.604675 -1.529072
C  0.00566 -2.191652 -0.009665
C  0.012595 -3.700398 0.017071
H  -3.445117 -1.193221 0.757302
H  -4.325623 0.3651 0.845439
H  -1.541957 2.325633 -0.489259
H  -3.328429 2.277332 -0.378267
H  3.451873 -1.164038 -0.779547
H  4.323001 0.400515 -0.845988
H  1.525622 2.332535 0.494692
H  3.312141 2.296676 0.379641
H  -4.418424 0.390367 -1.729227
H  -3.588656 -1.199912 -1.728426
H  -5.233211 -1.044171 -1.034789
H  -3.12555 2.224675 2.179864
H  -1.343951 2.306964 2.005821
H  -2.362902 3.685562 1.481392
H  4.406625 0.395993 1.728794
H  3.587448 -1.199818 1.706181
H  5.233336 -1.025091 1.020516
H  3.104258 2.256239 -2.178127
H  1.322415 2.324153 -1.999925
H  2.332014 3.707912 -1.470932
H  0.871687 -4.089752 -0.552037
H  0.110156 -4.057719 1.059815
H  -0.932569 -4.093561 -0.388915
