program: Gaussian 09
title: 000033362
version: EM64L-G09RevD.01
frameworkgroup: C1[X(C13H17NO3)]
method: RPBEPBE
basis: SDD
operation: Freq
keyword: #p
keyword: freq=noraman
keyword: PBEPBE/SDD
title: #p freq=noraman PBEPBE/SDD
converged: YES YES NO NO
title: Mulliken charges:
elementType: O O O N C C C C C C C C C C C C C H H H H H H H H H H H H H H H H H
charge: -0.255397 -0.352757 -0.374753 -0.350507 -0.381081 -0.342963 -0.296599 -0.684997 0.346432 -0.352665 -0.388493 0.496079 -0.381373 -0.374647 -0.261022 -0.354258 0.295190 0.212661 0.212799 0.194155 0.194042 0.206722 0.206179 0.213265 0.213232 0.219121 0.248839 0.254882 0.221003 0.239456 0.267852 0.207395 0.324406 0.377800
chargesum: 0.00000
title: Mulliken charges with hydrogens summed into heavy atoms:
elementType: O O O N C C C C C C C C C C C C C
charge: -0.255397 -0.352757 0.003047 -0.026101 0.044379 0.045234 0.116303 -0.039379 0.346432 -0.103826 -0.133611 0.496079 -0.160370 -0.135191 0.006830 -0.146863 0.295190
polarizability: 3.60418754e+02 2.29426744e+01 1.56376585e+02 -3.13189275e-01 3.13137345e-01 8.18051645e+01
1716.lowfreq: -16.5395 -3.3718 -2.6541 -0.0007 0.0007 0.0011 21.1035 29.3443 40.6223
frequency: 21.0742 28.8393 40.6165 53.8857 58.8301 83.2710 88.0034 115.1956 147.2757 158.5598 181.7363 213.4581 213.5914 222.2238 232.3089 292.3120 316.8410 338.8391 385.4909 387.0475 415.6458 471.6031 506.8360 514.7165 546.3360 556.3646 632.6364 678.9794 724.3074 737.1920 742.6947 785.2756 805.0401 820.9523 832.1598 846.3732 863.6866 903.8523 936.8803 945.2953 961.9080 965.8710 965.9190 998.8746 1000.0985 1021.3053 1040.6128 1083.4024 1117.2609 1124.9284 1144.0719 1176.0715 1180.0104 1213.0130 1218.6723 1240.4195 1272.7345 1280.9526 1284.7498 1291.9347 1298.2084 1319.5047 1344.6491 1364.4441 1375.5857 1385.8025 1392.8255 1432.9411 1468.9372 1470.5444 1472.6548 1476.4441 1481.0038 1489.4950 1505.1028 1560.0088 1570.1362 1617.7624 1642.4976 2950.6403 2966.7803 2977.4362 2995.5967 3008.8218 3011.9624 3060.8347 3076.3411 3077.9774 3101.8715 3113.2990 3132.6872 3134.1581 3158.4791 3165.5674 3169.9578 3622.1203
redmass: 4.0926 2.8640 5.0344 2.1278 4.6494 4.9482 4.6708 3.6648 1.9902 5.0158 3.7414 3.6572 4.0268 1.1757 4.2468 6.0516 1.5010 5.2598 3.1621 3.2300 2.9357 4.4781 4.4194 2.2118 1.2024 6.3602 6.9237 3.2007 6.5551 3.7610 1.0756 5.6003 1.2449 1.2002 1.6181 4.8294 1.7987 1.8014 1.1948 1.3179 7.0598 5.6237 1.3382 1.2374 2.7035 5.6538 3.4229 2.1831 1.4991 2.2579 1.4439 1.5221 1.2928 1.3732 1.6253 2.6859 1.3148 1.1853 1.0595 1.4592 1.7103 1.3573 1.4740 2.5511 1.8492 2.2277 1.2437 3.9272 1.1618 2.0022 1.1182 1.0421 1.1035 1.1197 2.3356 2.6823 5.8770 5.9291 5.7061 1.0552 1.0590 1.0363 1.0592 1.1031 1.1041 1.1045 1.1016 1.0994 1.0919 1.0883 1.0892 1.0885 1.0624 1.0943 1.0957 1.0827
irintensity: 1.0751 1.9617 0.1532 0.9661 1.9843 0.5828 3.7061 11.9943 5.1426 0.2876 33.9898 1.6631 1.5283 0.2389 4.3740 23.2488 81.1842 13.3016 13.1122 0.3885 0.4967 2.8519 1.6679 0.0782 179.6231 54.7414 0.5096 6.2561 2.0472 1.2314 11.1977 2.3279 10.1639 3.2058 96.2878 17.7626 0.6208 23.5822 1.3957 1.2476 118.5097 55.2157 5.8683 42.6311 2.2367 178.5086 27.6240 9.8469 9.8211 14.0304 1.7526 2.2608 221.7653 0.0233 21.5233 347.0520 11.7166 0.3943 0.0398 130.6641 1.3741 6.8618 0.1059 67.0670 22.9129 190.6222 2.7930 0.8901 47.9490 135.8814 5.1639 13.3702 34.3355 39.9777 104.0724 89.5044 12.3861 293.1215 61.2402 27.6505 35.5621 38.2371 36.8150 28.9925 0.0022 17.4155 101.8089 48.5958 0.4911 17.5361 11.1815 11.1127 35.8514 16.5985 7.3987 92.3218
temp: 298.150 k
press: 1.00000 atm
elementType: 8 8 8 7 6 6 6 6 6 6 6 6 6 6 6 6 6 1 1 1 1 1 1 1 1 1 1 1 1 1 1 1 1 1
symmnumber: 1
zpe: 722676.7 jmol-1
zpe.correction: 0.275253 hartree
zpe.thermalcorrener: 0.293524 hartree
zpe.thermalcorrenthalpy: 0.294468 hartree
zpe.thermalcorrgfe: 0.226169 hartree
zpe.sumelectzpe: -784.668508 hartree
zpe.sumelectthermal: -784.650237 hartree
zpe.sumelectthermalent: -784.649293 hartree
zpe.sumelectthermalfe: -784.717593 hartree
dipole: 5.8339 -3.5570 -0.0196
dipole: 6.8328
quadrupole: -118.5943 -92.7303 -105.7964
quadrupole: 3.5421 0.0439 0.0709
quadrupole: -12.8873 12.9767 -0.0894 3.5421 0.0439 0.0709
hfenergy: -784.9437613 hartree
pointgroup: C01 [X(C13H17N1O3)]
dipole: 2.2869357 -1.3877913 0.2656055 debye
polarizability: 360.4463112|19.4864229|151.9444613|-12.5094974|-17.1366239|86.2097313 unknown
InChI: InChI=1S/C13H17NO3/c1-2-3-10-17-12-7-4-11(5-8-12)6-9-13(15)14-16/h4-9,14,16H,2-3,10H2,1H3
charge 0 multiplicity 1
34 atoms
O  3.098016 0.623272 -0.354398
O  -5.52436 0.839956 -0.152352
O  -7.151709 -1.141048 0.36467
N  -5.73567 -1.365146 0.371189
C  5.386525 -0.14858 -0.217392
C  6.359929 -1.322421 0.041568
C  3.923579 -0.576086 -0.091396
C  7.838264 -0.895764 -0.083427
C  1.708691 0.4993 -0.287436
C  1.018837 -0.706482 0.015863
C  0.974301 1.685223 -0.546768
C  -1.146344 0.46552 -0.197833
C  -0.387333 -0.711849 0.057466
C  -0.426943 1.661715 -0.501054
C  -2.60919 0.512438 -0.164941
C  -3.4778 -0.513495 0.102139
C  -4.929103 -0.278122 0.091538
H  5.58394 0.670489 0.500328
H  5.554618 0.264151 -1.23054
H  6.150991 -2.143133 -0.674762
H  6.180464 -1.73681 1.054743
H  3.672117 -1.365127 -0.830424
H  3.705152 -0.957437 0.927841
H  8.055185 -0.508814 -1.09652
H  8.082416 -0.096366 0.640793
H  8.519144 -1.744968 0.107309
H  1.565716 -1.631877 0.217779
H  1.523967 2.602228 -0.778476
H  -0.899896 -1.651257 0.293082
H  -0.9871 2.582625 -0.702205
H  -3.07525 1.485364 -0.379132
H  -3.126786 -1.528694 0.329492
H  -5.491066 -2.327236 0.594071
H  -7.165204 -0.149472 0.131587
