program: Gaussian 09
title: 000033397
version: EM64L-G09RevD.01
frameworkgroup: C1[X(C14H20Cl3N5)]
method: RPBEPBE
basis: SDD
operation: Freq
keyword: #p
keyword: freq=noraman
keyword: PBEPBE/SDD
title: #p freq=noraman PBEPBE/SDD
converged: YES YES NO NO
title: Mulliken charges:
elementType: Cl Cl Cl N N N N N C C C C C C C C C C C C C C H H H H H H H H H H H H H H H H H H H H
charge: 0.086232 0.111152 0.084184 -0.117987 -0.115632 -0.149257 -0.089375 -0.065275 -0.403096 -0.403414 -0.377806 -0.376446 -0.376743 -0.377321 -0.398097 -0.394451 -0.394615 -0.399171 0.130408 0.108961 0.270756 -0.754834 0.191013 0.222084 0.222455 0.191222 0.204880 0.212149 0.209607 0.201458 0.210061 0.202088 0.204917 0.212125 0.204448 0.284390 0.261493 0.207261 0.262263 0.207917 0.204795 0.285201
chargesum: 0.00000
title: Mulliken charges with hydrogens summed into heavy atoms:
elementType: Cl Cl Cl N N N N N C C C C C C C C C C C C C C
charge: 0.086232 0.111152 0.084184 -0.117987 -0.115632 -0.149257 -0.089375 -0.065275 0.010001 0.010263 0.039223 0.034620 0.035406 0.039722 0.090741 0.074303 0.075564 0.090825 0.130408 0.108961 0.270756 -0.754834
polarizability: 2.94463757e+02 -2.29778439e+00 2.31557753e+02 9.15693535e-02 1.71733718e+00 1.55954184e+02
1716.lowfreq: -5.1254 -0.0004 0.0007 0.0019 2.3254 6.3909 9.2864 33.4601 40.5003
frequency: 1.7408 33.4028 40.4028 47.3239 62.7341 83.7597 88.4215 96.9424 160.2513 161.3897 166.9294 187.5224 197.4514 216.8898 224.6749 257.6288 264.4053 276.5848 289.7399 312.1033 320.9279 367.3651 392.9946 394.1539 401.1612 433.0616 438.8565 464.7937 498.5581 501.0433 587.7832 596.6067 600.0754 617.4037 691.8227 702.3537 746.1763 747.1877 782.9618 804.1660 804.3315 807.9728 821.5503 843.6401 847.5246 849.6799 889.6900 900.8912 905.5444 906.0245 948.3389 952.6035 987.5510 996.4510 1029.3586 1030.0135 1060.0371 1073.1011 1088.7847 1090.3569 1124.0089 1125.1462 1150.0686 1152.7333 1156.9567 1157.7128 1216.4960 1231.3459 1245.4130 1254.2869 1254.9633 1272.3086 1275.4941 1292.9223 1299.1712 1312.7399 1326.5653 1328.5205 1337.6470 1339.7177 1343.6742 1344.6335 1345.6018 1348.3566 1361.7082 1362.9363 1422.8358 1455.9403 1460.2430 1462.0967 1463.8040 1465.2371 1467.8580 1469.9558 1473.7306 1475.3897 1479.9137 1482.2958 1535.8625 1576.2120 2956.8031 2957.0140 2959.6748 2960.7566 2968.8981 2969.4856 2987.1202 2987.4511 2989.5133 2989.6348 3037.1350 3037.6493 3048.4403 3048.6347 3056.7581 3057.1330 3099.7451 3101.1445 3102.5127 3102.6455
redmass: 19.0634 4.1371 3.7426 3.9726 3.4436 6.4614 4.6438 5.2570 7.7239 4.9061 9.1139 4.3765 5.1109 3.9459 5.0851 2.7174 2.6072 4.2877 14.2723 2.9345 3.2729 14.9341 2.4516 3.0659 1.9510 3.1034 2.9288 3.4232 2.4982 2.4976 2.5025 6.7735 3.0526 7.4694 7.8740 11.5678 7.5873 11.9411 5.5590 1.5354 9.7572 1.4798 3.2596 2.9462 1.4391 1.4110 7.0849 3.0171 2.5876 3.4889 1.3076 1.3055 2.6399 3.1238 2.3998 2.5421 2.2516 2.3181 1.4955 1.4742 2.4201 2.3942 2.0872 1.6056 1.5731 1.4649 2.7536 2.1124 2.9645 1.2633 1.2759 1.2256 1.2293 1.4616 2.6591 4.7189 1.2689 1.2765 1.3838 1.3812 1.4669 1.4369 1.4393 1.4493 1.4812 1.4249 9.1648 1.0948 1.0930 1.1122 1.1088 1.0992 1.0997 1.1015 1.0836 1.5104 1.1924 1.9605 5.5170 6.8460 1.0698 1.0699 1.0702 1.0703 1.0637 1.0636 1.0613 1.0614 1.0610 1.0609 1.0964 1.0963 1.1026 1.1027 1.1032 1.1032 1.0926 1.0919 1.0935 1.0936
irintensity: 0.0037 0.5358 0.0668 0.1412 0.0541 0.0430 0.6247 0.3034 1.5822 0.9218 0.2391 2.1274 0.5478 0.0857 0.0464 1.3953 0.9832 0.0404 0.0803 1.6890 3.4339 0.7019 0.0991 1.4604 7.5437 0.2976 0.1396 0.4861 3.9162 4.5293 0.1461 26.6758 19.9965 56.7129 65.2680 0.3314 63.1133 106.3494 70.4145 0.3484 1.4692 0.3599 2.7890 24.1714 26.0090 20.0206 46.7993 13.1013 4.7766 17.0005 6.8624 8.0780 44.5377 4.0709 35.3862 26.4307 2.1813 8.6407 0.8122 3.8313 5.8315 4.1678 10.2564 0.3210 0.3456 1.5742 13.7072 189.3940 6.4888 4.1326 0.1527 15.3186 20.3068 33.6605 154.4699 5.5163 0.2971 1.3450 3.9403 4.1709 14.3849 5.1374 1.0384 0.7460 9.4758 12.9165 415.9387 4.2644 3.0071 76.2549 40.9643 7.1196 30.8345 1.2833 8.8091 3.8445 13.3023 40.1353 1659.3028 201.9736 3.0797 24.5734 87.5579 99.6473 57.4232 46.0628 2.7369 52.4930 20.8508 40.8429 65.6005 64.3253 18.1440 42.4535 77.8346 107.6128 2.1183 7.9591 5.8958 4.8912
temp: 298.150 k
press: 1.00000 atm
elementType: 17 17 17 7 7 7 7 7 6 6 6 6 6 6 6 6 6 6 6 6 6 6 1 1 1 1 1 1 1 1 1 1 1 1 1 1 1 1 1 1 1 1
symmnumber: 1
zpe: 880235.3 jmol-1
zpe.correction: 0.335264 hartree
zpe.thermalcorrener: 0.356523 hartree
zpe.thermalcorrenthalpy: 0.357467 hartree
zpe.thermalcorrgfe: 0.280771 hartree
zpe.sumelectzpe: -2197.761819 hartree
zpe.sumelectthermal: -2197.740559 hartree
zpe.sumelectthermalent: -2197.739615 hartree
zpe.sumelectthermalfe: -2197.816312 hartree
dipole: -0.5908 -6.2370 -0.1644
dipole: 6.2670
quadrupole: -129.0618 -153.3050 -150.9193
quadrupole: -1.7057 -0.0069 0.3899
quadrupole: 15.3669 -8.8763 -6.4906 -1.7057 -0.0069 0.3899
hfenergy: -2198.0970826 hartree
pointgroup: C01 [X(C14H20Cl3N5)]
dipole: -0.0755302 2.4417603 0.3339131 debye
polarizability: 294.5002634|-1.7302516|230.2415905|-0.0559432|9.8997548|157.2338404 unknown
InChI: InChI=1S/C14H20Cl3N5/c15-14(16,17)11-18-12(21-7-3-1-4-8-21)20-13(19-11)22-9-5-2-6-10-22/h1-10H2
charge 0 multiplicity 1
42 atoms
Cl 0.89107 -4.246769 0.870607
Cl -1.692408 -4.009278 -0.665708
Cl 0.926968 -3.511627 -2.072237
N  2.361253 0.759911 0.540403
N  -2.361853 0.799767 0.545808
N  0.00014 0.842529 0.545342
N  -1.230708 -1.208135 0.05465
N  1.191649 -1.225815 0.049793
C  4.683717 2.274112 -0.360062
C  -4.659574 2.343646 -0.367179
C  4.51991 0.771616 -0.693139
C  3.301337 2.9465 -0.17807
C  -3.265629 2.993831 -0.193433
C  -4.522272 0.835245 -0.685307
C  3.653306 0.057084 0.369614
C  2.453634 2.196271 0.876186
C  -2.430127 2.240595 0.868429
C  -3.665691 0.116804 0.383027
C  1.157911 0.122296 0.376987
C  -1.167785 0.145203 0.382126
C  -0.026182 -1.796261 -0.091918
C  -0.002386 -3.288698 -0.464207
H  5.267877 2.379984 0.577991
H  5.258589 2.785259 -1.154998
H  -5.226525 2.856467 -1.166683
H  -5.240735 2.468904 0.570317
H  5.506979 0.27401 -0.744827
H  4.040173 0.65699 -1.684471
H  2.756849 2.948624 -1.142449
H  3.418666 4.000751 0.138289
H  -2.72196 2.975454 -1.158024
H  -3.364259 4.053381 0.111131
H  -5.517828 0.354043 -0.729518
H  -4.04721 0.701932 -1.676581
H  4.184342 0.058456 1.345279
H  3.436526 -0.984854 0.092002
H  1.430732 2.595789 0.93992
H  2.931936 2.294098 1.874101
H  -1.40047 2.623244 0.927655
H  -2.905752 2.35569 1.865669
H  -4.194923 0.137609 1.359399
H  -3.466987 -0.931255 0.115287
